{"text_format":"1","workbook":"xlsx","n_sheets":9,"sheets":["Datei-Info","Navigation","Angebotsvergleich","Nutzwertanalyse Angebotsvgl.","Eigenbau","Nutzwertanalyse Eigenbau","Angebotsübersicht","D Nutzwerte","Sensitivitätsanalyse"],"not_rendered":{"charts":1,"images":1,"macros":1,"external_links":2,"defined_names":34,"comments":2,"pivot_tables":0},"unopened":[],"bounds":{"document_bytes":16777216,"sheet_cells":100000,"rows_first":2000,"rows_last":500,"rows_between":2000,"halvings":0,"cell_chars":16384,"cell_head_chars":4096},"cells_cut":0,"cells_raw":0,"read":"whole","date_system":"1900"}

{"sheet":"Datei-Info","index":0,"n_rows":6,"n_cols":3,"rows_kept":6,"cut":false,"hidden":false,"merged":[[14,1,14,9],[9,1,9,9],[1,1,1,9],[7,1,7,6],[8,1,8,9],[10,1,10,9],[11,1,11,9],[12,1,12,9],[13,1,13,9],[5,1,5,9]]}
[]
[null,"Berechnungshilfe des Kompetenzzentrums Contracting für Gebäude der Deutschen Energie-Agentur GmbH (dena)"]
[]
[null,"Urheber: Deutsche Energie-Agentur GmbH (dena)"]
[null,"Version:","2017-01-04"]
[null,"www.kompetenzzentrum-contracting.de"]

{"sheet":"Navigation","index":1,"n_rows":62,"n_cols":3,"rows_kept":62,"cut":false,"hidden":false,"merged":[]}
[null,"Berechnungshilfe für die Angebotsbewertung und Wirtschaftlichkeitsuntersuchung im Energiespar-Contracting"]
[]
[null,"Hintergrund"]
[null,"Die Angebotsbewertung erfolgt mit einer Nutzwertanalyse, in der monetäre und nicht monetäre Kriterien berücksichtigt werden. \n"]
[null,"Die Gewichtung der Kriterien erfolgt mit den bereits in den Vergabeunterlagen bekannt gegebenen Zuschlagskriterien."]
[null,"Für die monetäre Bewertung der Contracting-Angebote ist die Kapitalwertmethode anzuwenden. "]
[null,"Die Berechnung erfolgt auf Grundlage der Angebotsinhalte und der in den Vergabeunterlagen veröffentlichten Parametern zur Wirtschaftlichkeitsbetrachtung."]
[null,"Die nicht monetär bewertbaren Aspekte der Angebote werden in der anschließenden Nutzwertanalyse berücksichtigt."]
[]
[]
[null,"Basis der Berechnungshilfe"]
[null,"Diese Berechnungshilfe orientiert sich an folgenden Dokumenten:"]
[null,"Bundeshaushaltsordnung BHO §7"]
[null,"Allgemeine Verwaltungsvorschriften zur BHO (VV-BHO) des BMF"]
[null,"Arbeitsanleitung Einführung in Wirtschaftlichkeitsuntersuchungen des BMF"]
[null,"Forschungsbericht \"Vergleichende Untersuchung zum Erfolg der Umsetzung von Energiesparmaßnahmen in Contracting- Vorhaben und "]
[null,"bei Eigenrealisierung\" BMVBS-AZ 10.08.17.7-10.08"]
[null,"Forschungsbericht \"Monetäre Bewertung der Risikoübernahme durch private Energiedienstleister im Energiespar-Contracting\" BMVBS-AZ 10.08.17.7-10.09"]
[]
[null,"Berechnungsblätter","Mit dieser Datei werden Berechnungsblätter zur Verfügung gestellt, die eine Bewertung verschiedener Contracting-Angebote unterstützen und den Vergleich mit der Durchführung von Energiespar-Maßnahmen im Eigenbau ermöglichen. Diese Dokumentation ist als Ergänzung zum \"Leitfaden Energiespar-Contracting\" der Deutschen Energie-Agentur GmbH zu verstehen und beschränkt sich auf die Erläuterung einiger zentraler, in den Berechnungsblättern verwendeter Formeln. Durch ein Entsperren des Schreibschutzes der Rechenblätter (MS Office 2003 und früher: Menü: Extra - Schutz - Blattschutz aufheben, bzw. MS Office 2007: Überprüfen: Blattschutz aufheben) ist es so möglich, die Berechnungen an die Rahmenbedingungen des jeweiligen Projektes anzupassen."]
{"$rows_left_out":43}
{"sheet":"Angebotsvergleich","index":2,"n_rows":432,"n_cols":30,"rows_kept":432,"cut":false,"hidden":false,"merged":[[41,15,41,16],[108,4,108,5],[108,10,108,11],[24,2,27,2]]}
[null,"Link zur Navigationseite"]
[]
[null,"Berechnungshilfe für die Angebotsbewertung und Wirtschaftlichkeitsuntersuchung im Energiespar-Contracting"]
[]
[null,"Angebotsvergleich Contracting-Anbieter: Berechnung Nettoeinsparungen und Kapitalwert"]
[]
["Projekt:","Testprojekt",null,"Eingabefelder"]
["Datum:","2016-01-01",null,"Eingabefelder/ Vorschlag Berechnungswerte"]
["Bearbeiter:","Testbearbeiter",null,"Berechnete Werte"]
[null,null,null,"Alle Kostenangaben netto"]
[]
[null,"Eingaben in diesem Blatt:"]
[null,"Zentrales Blatt für die Eingabe"]
[null,"- Berechnungsgrundlagen/ Parameter für die Wirtschaftlichkeitsbetrachtung"]
[null,"- Angebotsdaten"]
[null,"- Vergleichdaten mit Eigenbaumaßnahme"]
[null,"- Ersatzinvestitionen (bei Bedarf)"]
[]
[null,"Baseline:"]
[]
{"$rows_left_out":413}
{"sheet":"Nutzwertanalyse Angebotsvgl.","index":3,"n_rows":50,"n_cols":33,"rows_kept":50,"cut":false,"hidden":false,"merged":[]}
[null,"Link zur Navigationseite"]
[]
[null,"Berechnungshilfe für die Angebotsbewertung und Wirtschaftlichkeitsuntersuchung im Energiespar-Contracting"]
[]
[null,"Nutzwertanalyse"]
[]
[]
["Projekt:",{"$f":"Angebotsvergleich!$B$7","v":"Testprojekt"},null,"Eingabefelder"]
["Datum:",{"$f":"Angebotsvergleich!$B$8","v":"2016-01-01"},null,"Berechnete Werte"]
["Bearbeiter:",{"$f":"Angebotsvergleich!$B$9","v":"Testbearbeiter"},null,"Alle Kostenangaben netto"]
[]
[]
[null,"Eingaben in diesem Blatt:"]
[null,"Gewichtung der Kriterien gemäß Festlegung in den Vergabeunterlagen"]
[null,"Bewertung des Technisch-Organisatorischen Konzepts"]
[]
[null,"Für das Kriterium \"Technisch-Organisatorisches Konzept\" bietet sich eine Bewertung nach folgender Tabelle an:"]
[null,"0 Punkte","ungenügend, grobe Mängel, Maßnahmen nicht umsetzbar, nicht passend zur vorhandenen Anlagentechnik/ zum Objekt "]
[null,"30 Punkte","ausreichend, mit größeren Mängeln, Maßnahmen schwer umsetzbar"]
[null,"50 Punkte","befriedigend, mit kleineren Mängeln, Maßnahmenkonzept überwiegend plausibel und umsetzbar"]
{"$rows_left_out":31}
{"sheet":"Eigenbau","index":4,"n_rows":70,"n_cols":25,"rows_kept":70,"cut":false,"hidden":false,"merged":[]}
[null,"Link zur Navigationseite"]
[]
[null,"Berechnungshilfe für die Angebotsbewertung und Wirtschaftlichkeitsuntersuchung im Energiespar-Contracting"]
[]
[null,"Wirtschaftlichkeitsvergleich"]
[null,{"$f":"\"Contracting-Anbieter \"&INDEX(Angebotsvergleich!B44:B60,Eigenbau!$C$21)&\" vs. Eigenbaumaßnahme\"","v":"Contracting-Anbieter Anbieter 1 vs. Eigenbaumaßnahme"}]
[]
["Projekt:",{"$f":"Angebotsvergleich!$B$7","v":"Testprojekt"},null,"Eingabefelder"]
["Datum:",{"$f":"Angebotsvergleich!$B$8","v":"2016-01-01"},null,"Eingabefelder/ Vorschlag Berechnungswerte"]
["Bearbeiter:",{"$f":"Angebotsvergleich!$B$9","v":"Testbearbeiter"},null,"Berechnete Werte"]
[null,null,null,"Alle Kostenangaben netto"]
[]
[null,"Eingaben in diesem Blatt:"]
[null,"Auswahl Contracting-Anbiete für Vergleich mit Eigenbaumaßnahmen"]
[null,"Tabelle 5: Parameter für Eigenbaumaßnahme"]
[]
[]
[null,null,"Auswahl für Vergleich mit Eigenbaumaßnahme"]
[null,null,"Contracting-"]
[null,null,"Anbieter Nr."]
{"$rows_left_out":51}
{"sheet":"Nutzwertanalyse Eigenbau","index":5,"n_rows":35,"n_cols":5,"rows_kept":35,"cut":false,"hidden":false,"merged":[]}
[null,"Link zur Navigationseite"]
[]
[null,"Berechnungshilfe für die Angebotsbewertung und Wirtschaftlichkeitsuntersuchung im Energiespar-Contracting"]
[]
[null,"Nutzwertanalyse"]
[null,{"$f":"\"Contracting-Anbieter \"&INDEX(Angebotsvergleich!B44:B60,Eigenbau!$C$21)&\" vs. Eigenbaumaßnahme\"","v":"Contracting-Anbieter Anbieter 1 vs. Eigenbaumaßnahme"}]
[]
["Projekt:",{"$f":"Angebotsvergleich!$B$7","v":"Testprojekt"}]
["Datum:",{"$f":"Angebotsvergleich!$B$8","v":"2016-01-01"}]
["Bearbeiter:",{"$f":"Angebotsvergleich!$B$9","v":"Testbearbeiter"},null,"Berechnete Werte"]
[null,null,null,"Alle Kostenangaben netto"]
[null,"Eingaben in diesem Blatt:"]
[null,"keine, speist sich aus Tabellenblatt \"Eigenbau\""]
[]
[null,null,"Gewichtung"]
[null,"Bewertungskriterien","[%]",{"$f":"\"Eigenbau\nim Vergleich zu\n\"&INDEX(Angebotsvergleich!B44:B73,Eigenbau!$C$21)","v":"Eigenbau\nim Vergleich zu\nAnbieter 1"},{"$f":"INDEX(Angebotsvergleich!B44:B73,Eigenbau!$C$21)","v":"Anbieter 1"}]
[null,"Kapitalwert",{"$f":"'Nutzwertanalyse Angebotsvgl.'!C32","v":0},{"$f":"Eigenbau!X70","v":0},{"$f":"Eigenbau!X61","v":0}]
[null,"Forfaitierter Betrag in Vertragslaufzeit [€] (Risikoarmes Finanzierungskonzept)",{"$f":"'Nutzwertanalyse Angebotsvgl.'!C33","v":0},0,{"$f":"INDEX('Nutzwertanalyse Angebotsvgl.'!D33:AG33,bieter_nr)","v":""}]
[null,"Technisch-organisatorisches Konzept",{"$f":"'Nutzwertanalyse Angebotsvgl.'!C34","v":0},{"$f":"E19","v":0},{"$f":"INDEX('Nutzwertanalyse Angebotsvgl.'!D34:AG34,bieter_nr)","v":0}]
[null,"Summe",{"$f":"SUM(C17:C19)","v":0}]
{"$rows_left_out":16}
{"sheet":"Angebotsübersicht","index":6,"n_rows":47,"n_cols":30,"rows_kept":47,"cut":false,"hidden":false,"merged":[]}
[null,"Link zur Navigationseite"]
[]
[null,"Berechnungshilfe für die Angebotsbewertung und Wirtschaftlichkeitsuntersuchung im Energiespar-Contracting"]
[]
[null,"Angebotsübersicht"]
[]
["Projekt:",{"$f":"Angebotsvergleich!$B$7","v":"Testprojekt"}]
["Datum:",{"$f":"Angebotsvergleich!$B$8","v":"2016-01-01"},null,"Berechnete Werte"]
["Bearbeiter:",{"$f":"Angebotsvergleich!$B$9","v":"Testbearbeiter"},null,"Alle Kostenangaben netto"]
[]
[]
[null,"Eingaben in diesem Blatt:"]
[null,"keine, speist sich aus Angebotsvergleich und dient der übersichtlichen Darstellung der Ergebnisse des Vergabeverfahrens"]
[]
["Baseline:",{"$f":"Angebotsvergleich!C19","v":0}]
[]
["Bieter","Nutzwertpunkte","Platz","Einspargarantie\nElektroenergie-Kosten\n[Euro/a]","Einspargarantie\nWärmeenergie-Kosten\n[Euro/a]","Einspargarantie\nWasser/Abwasser-Kosten\n[Euro/a]","Einsparung\nCO2-Emissionen\n[t CO2/a]","Einspargarantie\nsonstige jährliche Kosten\n[Euro/a]","Garantierte\nSteuerrückerstattung\n[Euro/a]","Garantierte\nEEG Vergütung\n[Euro/a]","Garantierte\nKWK Vergütung\n[Euro/a]","Summe Einspargarantie [Euro/a]","Einsparquote","Beteiligung\nAuftraggeber an \nGarantieein-sparung\n[%]","Haushalts-entlastung AG [Euro/a]","Contractingrate AN [Euro/a]","Dauer\nGarantie-phase\n[Jahre]","Summe Contractingrate [Euro]","Investitionen in \ntechnische Geräte, Anlagen und Sachen [Euro]","Investitionen des Contractors (ohne BKZ) [Euro]","Investitionen des Contractors geg. Vergütung Contr. [%]","Projektierungs-kosten\nFeinanalyse [Euro]","Einmaliger Baukosten-zuschuss des Auftraggebers [Euro]","Beginn \nGarantie-phase\n[Kalendermonat]","Forfaitierter \nBetrag [Euro/a]","Anteil Forfaitierung an Grundvergütung [Euro]","Kapitalwert [Euro]","Abweichung vom besten Kapitalwert \n[%]","Kennzeichnung maximal und minimal Kapitalwerte","Beteiligung\nAuftraggeber an zusätzl. Einsparung [%]"]
[{"$f":"Angebotsvergleich!B44","v":"Anbieter 1"},{"$f":"'Nutzwertanalyse Angebotsvgl.'!$D$48","v":{"$error":"#DIV/0!"}},{"$f":"'Nutzwertanalyse Angebotsvgl.'!$D$49","v":{"$error":"#DIV/0!"}},{"$f":"Angebotsvergleich!J44","v":0},{"$f":"Angebotsvergleich!K44","v":0},{"$f":"Angebotsvergleich!L44","v":0},{"$f":"Angebotsvergleich!M44","v":0},{"$f":"Angebotsvergleich!N44","v":0},{"$f":"Angebotsvergleich!O44","v":0},{"$f":"Angebotsvergleich!P44","v":0},{"$f":"Angebotsvergleich!Q44","v":0},{"$f":"Angebotsvergleich!R44","v":0},{"$f":"Angebotsvergleich!S44","v":""},{"$f":"IF(Angebotsvergleich!E77>0,1-Angebotsvergleich!E77,\"\")","v":""},{"$f":"Angebotsvergleich!I77","v":0},{"$f":"Angebotsvergleich!H77","v":0},{"$f":"Angebotsvergleich!C77","v":0},{"$f":"P18*Q18","v":0},{"$f":"Angebotsvergleich!L77","v":0},{"$f":"S18-W18","v":0},{"$f":"Angebotsvergleich!T44","v":""},{"$f":"Angebotsvergleich!M77","v":0},{"$f":"Angebotsvergleich!N77","v":0},{"$f":"Angebotsvergleich!O77","v":0},{"$f":"Angebotsvergleich!P77*12","v":0},{"$f":"Angebotsvergleich!S77","v":""},{"$f":"Angebotsvergleich!Z171","v":0},{"$f":"IF(AA18>0,1-AA18/MAX($AA$18:$AA$47),\"\")","v":""},{"$f":"IF(AB18=\"\",\"\",IF(AB18=0,\"maximal\",IF(AB18/MAX($AB$18:$AB$47)=1,\"minimal\",\"\")))","v":""},{"$f":"Angebotsvergleich!J77","v":0}]
[{"$f":"Angebotsvergleich!B45","v":"Anbieter 2"},{"$f":"'Nutzwertanalyse Angebotsvgl.'!$E$48","v":{"$error":"#DIV/0!"}},{"$f":"'Nutzwertanalyse Angebotsvgl.'!$E$49","v":{"$error":"#DIV/0!"}},{"$f":"Angebotsvergleich!J45","v":0},{"$f":"Angebotsvergleich!K45","v":0},{"$f":"Angebotsvergleich!L45","v":0},{"$f":"Angebotsvergleich!M45","v":0},{"$f":"Angebotsvergleich!N45","v":0},{"$f":"Angebotsvergleich!O45","v":0},{"$f":"Angebotsvergleich!P45","v":0},{"$f":"Angebotsvergleich!Q45","v":0},{"$f":"Angebotsvergleich!R45","v":0},{"$f":"Angebotsvergleich!S45","v":""},{"$f":"IF(Angebotsvergleich!E78>0,1-Angebotsvergleich!E78,\"\")","v":""},{"$f":"Angebotsvergleich!I78","v":0},{"$f":"Angebotsvergleich!H78","v":0},{"$f":"Angebotsvergleich!C78","v":0},{"$f":"P19*Q19","v":0},{"$f":"Angebotsvergleich!L78","v":0},{"$f":"S19-W19","v":0},{"$f":"Angebotsvergleich!T45","v":""},{"$f":"Angebotsvergleich!M78","v":0},{"$f":"Angebotsvergleich!N78","v":0},{"$f":"Angebotsvergleich!O78","v":0},{"$f":"Angebotsvergleich!P78*12","v":0},{"$f":"Angebotsvergleich!S78","v":""},{"$f":"Angebotsvergleich!Z180","v":0},{"$f":"IF(AA19>0,1-AA19/MAX($AA$18:$AA$47),\"\")","v":""},{"$f":"IF(AB19=\"\",\"\",IF(AB19=0,\"maximal\",IF(AB19/MAX($AB$18:$AB$47)=1,\"minimal\",\"\")))","v":""},{"$f":"Angebotsvergleich!J78","v":0}]
[{"$f":"Angebotsvergleich!B46","v":"Anbieter 3"},{"$f":"'Nutzwertanalyse Angebotsvgl.'!$F$48","v":{"$error":"#DIV/0!"}},{"$f":"'Nutzwertanalyse Angebotsvgl.'!$F$49","v":{"$error":"#DIV/0!"}},{"$f":"Angebotsvergleich!J46","v":0},{"$f":"Angebotsvergleich!K46","v":0},{"$f":"Angebotsvergleich!L46","v":0},{"$f":"Angebotsvergleich!M46","v":0},{"$f":"Angebotsvergleich!N46","v":0},{"$f":"Angebotsvergleich!O46","v":0},{"$f":"Angebotsvergleich!P46","v":0},{"$f":"Angebotsvergleich!Q46","v":0},{"$f":"Angebotsvergleich!R46","v":0},{"$f":"Angebotsvergleich!S46","v":""},{"$f":"IF(Angebotsvergleich!E79>0,1-Angebotsvergleich!E79,\"\")","v":""},{"$f":"Angebotsvergleich!I79","v":0},{"$f":"Angebotsvergleich!H79","v":0},{"$f":"Angebotsvergleich!C79","v":0},0,{"$f":"Angebotsvergleich!L79","v":0},0,{"$f":"Angebotsvergleich!T46","v":""},{"$f":"Angebotsvergleich!M79","v":0},{"$f":"Angebotsvergleich!N79","v":0},{"$f":"Angebotsvergleich!O79","v":0},{"$f":"Angebotsvergleich!P79*12","v":0},{"$f":"Angebotsvergleich!S79","v":""},{"$f":"Angebotsvergleich!Z189","v":0},"","",{"$f":"Angebotsvergleich!J79","v":0}]
{"$rows_left_out":28}
{"sheet":"D Nutzwerte","index":7,"n_rows":7,"n_cols":2,"rows_kept":7,"cut":false,"hidden":false,"merged":[]}
[null,"Link zur Navigationseite"]
[]
[null,"Berechnungshilfe für die Angebotsbewertung und Wirtschaftlichkeitsuntersuchung im Energiespar-Contracting"]
[]
["Projekt:",{"$f":"Angebotsvergleich!$B$7","v":"Testprojekt"}]
["Datum:",{"$f":"Angebotsvergleich!$B$8","v":"2016-01-01"}]
["Bearbeiter:",{"$f":"Angebotsvergleich!$B$9","v":"Testbearbeiter"}]

{"sheet":"Sensitivitätsanalyse","index":8,"n_rows":70,"n_cols":8,"rows_kept":70,"cut":false,"hidden":false,"merged":[]}
[null,"Link zur Navigationseite"]
[]
[null,"Berechnungshilfe für die Angebotsbewertung und Wirtschaftlichkeitsuntersuchung im Energiespar-Contracting"]
[]
[null,"Sensitivitätsanalyse"]
[null,"Wirtschaftlichkeitsnachweis bei veränderlichen wirtschaftlichen Rahmenbedingungen"]
[]
["Projekt:",{"$f":"Angebotsvergleich!$B$7","v":"Testprojekt"}]
["Datum:",{"$f":"Angebotsvergleich!$B$8","v":"2016-01-01"},null,"Berechnete Werte"]
["Bearbeiter:",{"$f":"Angebotsvergleich!$B$9","v":"Testbearbeiter"},null,"Alle Kostenangaben netto"]
[]
[null,"Eingaben in diesem Blatt:"]
[null,"In diesem Blatt sind keine Eingaben erforderlich."]
[null,"Über das Schaltfeld \"Zielwerte suchen\" können die Grenzfälle der Wirtschaftlichkeit berechnet werden."]
[]
[]
[]
[]
[null,{"$f":"\"Vergleich: Contracting-Anbieter \"&INDEX(Angebotsvergleich!B44:B73,Eigenbau!$C$21)&\" mit Eigenbaumaßnahme\"","v":"Vergleich: Contracting-Anbieter Anbieter 1 mit Eigenbaumaßnahme"}]
[]
{"$rows_left_out":50}