{"text_format":"1","workbook":"xlsx","n_sheets":9,"sheets":["Datei-Info","Navigation","Angebotsvergleich","Nutzwertanalyse Angebotsvgl.","Eigenbau","Nutzwertanalyse Eigenbau","Angebotsübersicht","D Nutzwerte","Sensitivitätsanalyse"],"not_rendered":{"charts":1,"images":1,"macros":1,"external_links":2,"defined_names":34,"comments":2,"pivot_tables":0},"unopened":[],"bounds":{"document_bytes":16777216,"sheet_cells":100000,"rows_first":2000,"rows_last":500,"rows_between":2000,"halvings":0,"cell_chars":16384,"cell_head_chars":4096},"cells_cut":0,"cells_raw":0,"read":"whole","date_system":"1900"}

{"sheet":"Datei-Info","index":0,"n_rows":6,"n_cols":3,"rows_kept":6,"cut":false,"hidden":false,"merged":[[14,1,14,9],[9,1,9,9],[1,1,1,9],[7,1,7,6],[8,1,8,9],[10,1,10,9],[11,1,11,9],[12,1,12,9],[13,1,13,9],[5,1,5,9]]}
[]
[null,"Berechnungshilfe des Kompetenzzentrums Contracting für Gebäude der Deutschen Energie-Agentur GmbH (dena)"]
[]
[null,"Urheber: Deutsche Energie-Agentur GmbH (dena)"]
[null,"Version:","2017-01-04"]
[null,"www.kompetenzzentrum-contracting.de"]

{"sheet":"Navigation","index":1,"n_rows":62,"n_cols":3,"rows_kept":62,"cut":false,"hidden":false,"merged":[]}
[null,"Berechnungshilfe für die Angebotsbewertung und Wirtschaftlichkeitsuntersuchung im Energiespar-Contracting"]
[]
[null,"Hintergrund"]
[null,"Die Angebotsbewertung erfolgt mit einer Nutzwertanalyse, in der monetäre und nicht monetäre Kriterien berücksichtigt werden. \n"]
[null,"Die Gewichtung der Kriterien erfolgt mit den bereits in den Vergabeunterlagen bekannt gegebenen Zuschlagskriterien."]
[null,"Für die monetäre Bewertung der Contracting-Angebote ist die Kapitalwertmethode anzuwenden. "]
[null,"Die Berechnung erfolgt auf Grundlage der Angebotsinhalte und der in den Vergabeunterlagen veröffentlichten Parametern zur Wirtschaftlichkeitsbetrachtung."]
[null,"Die nicht monetär bewertbaren Aspekte der Angebote werden in der anschließenden Nutzwertanalyse berücksichtigt."]
[]
[]
[null,"Basis der Berechnungshilfe"]
[null,"Diese Berechnungshilfe orientiert sich an folgenden Dokumenten:"]
[null,"Bundeshaushaltsordnung BHO §7"]
[null,"Allgemeine Verwaltungsvorschriften zur BHO (VV-BHO) des BMF"]
[null,"Arbeitsanleitung Einführung in Wirtschaftlichkeitsuntersuchungen des BMF"]
[null,"Forschungsbericht \"Vergleichende Untersuchung zum Erfolg der Umsetzung von Energiesparmaßnahmen in Contracting- Vorhaben und "]
[null,"bei Eigenrealisierung\" BMVBS-AZ 10.08.17.7-10.08"]
[null,"Forschungsbericht \"Monetäre Bewertung der Risikoübernahme durch private Energiedienstleister im Energiespar-Contracting\" BMVBS-AZ 10.08.17.7-10.09"]
[]
[null,"Berechnungsblätter","Mit dieser Datei werden Berechnungsblätter zur Verfügung gestellt, die eine Bewertung verschiedener Contracting-Angebote unterstützen und den Vergleich mit der Durchführung von Energiespar-Maßnahmen im Eigenbau ermöglichen. Diese Dokumentation ist als Ergänzung zum \"Leitfaden Energiespar-Contracting\" der Deutschen Energie-Agentur GmbH zu verstehen und beschränkt sich auf die Erläuterung einiger zentraler, in den Berechnungsblättern verwendeter Formeln. Durch ein Entsperren des Schreibschutzes der Rechenblätter (MS Office 2003 und früher: Menü: Extra - Schutz - Blattschutz aufheben, bzw. MS Office 2007: Überprüfen: Blattschutz aufheben) ist es so möglich, die Berechnungen an die Rahmenbedingungen des jeweiligen Projektes anzupassen."]
[]
[null,"Grundsätzliches","Die in den Berechnungsblättern ausgewiesenen Kosten werden jahresweise berechnet. Es handelt sich um nominale Werte, die anschließend mit dem nominalen Kalkulationszinsfuß auf den Zeitpunkt des Baubeginns (Start der Vorbereitungsphase) abge- zinst werden. Es wird mit jährlichen Kostensteigerungen (Elektroenergie, Heizenergie, Wasser, Investitionsgüter und Betriebsführungskosten) gerechnet, die mit der fortlaufenden Jahreszählung berechnet werden. Die Berechnung teilt sich durch die Jahrestaktung in mehrere Fallunterscheidungen auf, die sich in den EXCEL-Formeln als WENN-Beziehungen wiederfinden und die nachfolgend beschrieben werden."]
[]
[null,"Angebotsvergleich","Eingabe der Contracting-Angebote, Berechnungsgrundlagen und Parameter für die Wirtschaftlichkeitsberechnung"]
[null,"Erläuterung","Im Angebotsvergleich werden verschiedene Contracting-Angebote einander gegenüber gestellt und anhand der Angebotskonditionen ein Kapitalwert als Summe der jährlichen, barwertigen Nettoersparnisse berechnet. Das Angebot mit dem höchsten Kapitalwert stellt unter monetären Gesichtspunkten das günstigste Angebot dar."]
[null,"Einspargarantie Kosten","Der Contractor garantiert mit dem Erfolgsgarantie-Vertrag die Einsparung von Energie-, Wasser- und ggf. sonstigen Kosten. Die Einsparung der Kosten fließt gemäß den unten genannten Fallunterscheidungen in die Berechnung ein.  Nach Ablauf der Garantiephase wird davon ausgegangen, dass im anschließenden vollständigen Eigenbetrieb die Garantie nicht mehr vollständig erreicht wird, da der Spezialisierungsvorteil und wirtschaftliche Erfolgsdruck des Contractors entfällt. Die Höhe der eigenen Einsparung im Verhältnis zur Höhe der Einsparungen des Contractors wird durch den Faktor \"Einsparprognose Eigenbetrieb nach Vertragsende\" ausgedrückt.\nDie Kosteneinsparungen werden jährlich aus den eingesparten Energiemengen mit Preisänderungsfaktoren berechnet."]
[null,"Einsparprognose Eigenbetrieb","Der Faktor \"Einsparprognose Eigenbetrieb nach Vertragsende\" kann manuell angepasst oder entsprechend der hinterlegten Berechnungsvorschrift automatisch berechnet werden. Die Berechnungsvorschrift macht den Faktor von der Höhe der Investitionskosten abhängig. Liegen die Investitionskosten bei 50% der gesamten Zahlungen an den Contractor (jährliche Vergütung * Vertragslaufzeit), so sind die durchgeführten Energiesparmaßnahmen besonders nachhaltig und der Faktor erreicht seinen Maximalwert von 90%. Liegt der Investitionskostenanteil dagegen nur bei 25%, so wird der Faktor zu 80%. Nach unten ist der Faktor auf 70% limitiert.\nIm letzten Betriebsjahr werden die Einsparungen nur für die restliche technische Lebensdauer der Anlage (entsprechend der Dauer der Vorbereitungszeit) erreicht. Die Kosteneinsparungen werden aus den eingesparten Energiemengen mit jährlich steigenden (bzw. fallenden) Energiepreisen berechnet."]
[null,"Einsparung Betriebsführungskosten","Während der Dauer der Garantiephase übernimmt der Contractor Wartung und Instandhaltung, der von ihm eingebauten Anlagen. Dadurch spart er dem Auftraggeber Betriebsführungskosten ein. Die Höhe der Betriebsführungskosten wird durch einen fixen Anteil (z.B. 3%) an den Investitionskosten des Contractors mit jährlichen Preissteigerungsraten berechnet. Im ersten Betriebsjahr fallen diese Einsparungen erst nach dem Beginn der Garantiephase an (13 - Kalendermonat). In den darauf folgenden Jahren der Garantiephase werden die Betriebsführungskosten im vollen Umfang eingespart und im Jahr der Übergabe nur für die vom Contractor geleisteten Monate. In der Zeit des vollständigen Eigenbetriebs müssen die Betriebskosten wieder voll vom Auftraggeber übernommen werden, eine Einparung der Betriebsführungskosten findet dann nicht mehr statt."]
[null,"Vergütung Contractor","Die Vergütung des Contractors wird beim Vertragsabschluss festgelegt und ändert sich über die Dauer des Erfolgsgarantie-Vertrags nicht. Die Höhe der Vergütung entspricht der anteiligen Kosteneinsparung zuzüglich eines ggf. gezahlenten Finnazierungsbeitrags Für die Berechnung bedeutet dies, dass die Vergütung im ersten Jahr für die Monate nach der Vorbereitungsphase erfolgt, in der Garantiephase in vollem Umfang und im Jahr der Übergabe für die Dauer der Vorbereitungsphase. Geht die Anlage vollständig in den Eigenbetrieb über, erhält der Contractor keine Vergütung mehr."]
[null,"Einmaliger Baukostenzuschuss","Optional erhält der Contractor zu Beginn der Vorbereitungsphase einen einmaligen Baukostenzuschuss. Dieser Zahlungsstrom geht negativ in die Kapitalwertberechnung ein."]
[null,"Jährlicher Finazierungbeitrag","Optional erhält der Contractor zusätzlich zur Vergütung aus der Einsparung einen jährlichen Finanzierungsbeitrag. Dieser Zahlungsstrom geht negativ in die Kapitalwertberechnung ein."]
[null,"Ersatzinvestition/Restwert","Investitionen, die der Auftraggeber nach Ablauf der Garantiephase tätigen muss, um im Betrachtungszeitraum die Energieeinsparung aufrecht zu erhalten. Das z.B bei BHKW notwendig sein. Der Restwert der Ersatzinvestition geht am Ende des Betrachtunszeitraums positiv in die Bilanz ein. "]
[null,"Nutzwertanalyse Angebotsvergleich","In der Nutzwertanalyse werden die Contracting-Angebote anhand weiterer Angebotskonditionen auf ihren Nutzwert hin untersucht und verglichen. Zur Berechnung der Kriterienerfüllung (0 bis 100 Punkte) werden Formeln verwendet, um verschiedene Bewertungskriterien auf den gemeinsamen Punktemaßstab zu bringen. Diese Formeln können je nach Fragestellung durch andere, in den Erläuterungen aufgeführte Formeln, ersetzt werden."]
[null,"Angebotsübersicht","Die Angebotsübersicht zeigt eine Tabelle mit einer Zusammenfassung der wichtigsten Angaben der Contracting-Angebote: Punkte der Nutzwertanalyse und Rang, Einspargarantie, Angebotskonditionen und Ergebnisse der Kapitalwertberechnung."]
[null,"Eigenbau","Eingabe Daten des Eigenbaus und Vergleich mit einem ausgewählten Contracting-Anbieter"]
[null,"Erläuterung","Im Wirtschaftlichkeitsvergleich wird das wirtschaftlichste Contracting-Angebot (Auswahl durch Eingabe der Angebotsnummer) dem Eigenbau gegenüber gestellt. Die Fallunterscheidungen beim Eigenbau reduzieren sich auf drei Fälle: das erste Jahr, die Nutzungsdauer im Eigenbau und das letzte Betriebsjahr. Nachfolgend werden für den Eigenbau Erläuterungen gegeben:"]
[null,"Einsparung Energiekosten","Für die Eigenbauvariante wird eine Einsparung in Höhe der \"Einsparprognose Eigenbetrieb\" rechnerisch wirksam. Die Kosteneinsparungen werden jährlich aus den eingesparten Energiemengen mit Preisänderungsfaktoren berechnet."]
[null,"Investitionskosten","Für die Durchführung der Energiesparmaßnahmen wird zu Beginn der Bauzeit eine Investition getätigt. Die Höhe der Investition kann sich an der Höhe der Baukosten des zum Vergleich herangezogenen Contracting-Angebots orientieren (Investitionen in technische Geräte, Anlagen und Sachen). Es können ebenfalls  andere Datengrundlagen zur Kostenermittlung genutzt werden. Bei den Investitionskosten des Contractors ist gemäß Forschungsbericht \"Monetäre Bewertung der Risikoübernahme durch private Energiedienstleister im Energiespar-Contracting\" (Quelle s.o.) ein Risikozuschlag zu berücksichtigen, um das vom Contractor übernommene Kernrisiko der Kostenüberschreitung für Bau und Betrieb rechnerisch zu bewerten. Für die Ermittlung der Planungskosten sind nach Möglichkeit eigene Grundlagen zu verwenden. Stehen diese nicht zur Verfügung, können die Planungskosten als prozentualer Wert der Investitionskosten berechnet werden.   "]
[null,"Diagramm Nutzwerte","Dieses Diagramm zeigt eine grafische Auswertung der Nutzwertanalyse."]
[null,"Eigenbau","Eingabe Daten der Eigenbaumaßnahme. Berechnung des Kapitalwerte der Eigenbau-Variante und des Contracting-Angebotes unter Berücksichtigung von Risikofaktoren."]
[null,"Nutzwertanalyse Eigenbau","Vergleich der Eigenbaumaßnahme mit einem ausgewählten Contracting-Anbieter"]
[null,"Sensitvitätsanalyse","Wirtschaftlichkeitsnachweis bei veränderlichen wirtschaftlichen Rahmenbedingungen, Eigenbau im Vergleich zu einem Contracting-Anbieter"]
[null,"Erläuterung","Die Sensitivitätsanalyse dient dazu, zentrale wirtschaftliche Rahmenbedingungen zu variieren und die Auswirkung auf die Wirtschaftlichkeit der Investitionen (Contracting oder Eigenbau) zu untersuchen. Werden die Kapitalwerte des Contracting-Angebots und des Eigenbaus gleich, besteht für keine der Alternativen ein wirtschaftlicher Vorteil mehr. Wird ein Kapitalwert zu Null, ist diese Variante nicht mehr wirtschaftlich. Im Berechnungsblatt Sensitivitätsanalyse können diese Grenzfälle der Wirtschaftlichkeitsrechnung durch den Aufruf eines VBA-Makros schnell berechnet werden. Alternativ zum Makroaufruf können die einzelnen Werte auch durch die EXCEL-Funktion Zielwertsuche gefunden werden.\nDas VBA-Makro greift auf Namensbereiche zu, die in den EXCEL-Blättern definiert sind. Nachfolgend sind die verwendeten Namensbereiche aufgeführt. Bei einer Änderung der Rechenblätter ist darauf zu achten, dass die definierten Namen erhalten bleiben."]
[null,"k_contracting","Kapitalwert des wirtschaftlichsten Contracting-Angebots"]
[null,"k_eigen","Kapitalwert des Eigenbaus"]
[null,"k_diff","Differenz der beiden vorgenannten Kapitalwerte"]
[null,"r_strom","Jährliche Preissteigerungsrate Elektroenergie (veränderbare Zelle)"]
[null,"r_heiz","Jährliche Preissteigerungsrate Heizenergie (veränderbare Zelle)"]
[null,"r_wasser","Jährliche Preissteigerungsrate Wasser/Abwasser (veränderbare Zelle)"]
[null,"r_invest","Jährliche Preissteigerungsrate Investitionsgüter (veränderbare Zelle)"]
[null,"r_betrieb","Jährliche Preissteigerungsrate Betriebskosten Eigenbetrieb nach Ablauf Contracting-Vertrag (veränderbare Zelle)"]
[null,"r_Eigenbetrieb","Anteil der Einsparprognose des Eigenbetriebs zur garantierten Einsparung des Contractors"]
[null,"a_risiko","Risikoaufschlag auf die Investition"]
[null,"p_umwelt","Referenzpreis Umweltkosten"]
[]
[null,"Fallunterscheidungen in den Wirtschaftlichkeitsberechnungen"]
[null,"Fall/Bedingung","Phase innerhalb des Contracting-Projekts"]
[null,"Erstes Jahr\nWENN Jahr < 2","Mit dem ersten Jahr beginnt die Vorbereitungsphase, d.h. die Durchführung der Baumaßnahmen und es schließen sich erste Monate der Garantiephase an (siehe Beginn der Garantiephase in Kalendermonaten). Energiekosten werden erst in den Monaten der Garantiephase gesenkt."]
[null,"Garantiephase\nWENN Jahr < Dauer der Garantiephase +1","Garantiephase. In dieser Phase treten die garantierten Energieeinsparungen zu 100% ein und der Contractor erhält die volle Vergütung. Während der Garantiephase übernimmt der Contractor Wartung und Instandhaltung der von ihm eingebauten Anlagen. Der Auftraggeber spart Wartungs- und Instandhaltungskosten."]
[null,"Übergabe\nWENN Jahr < Dauer der Garantiephase +2","Nach der Dauer der Garantiephase geht die Betreuung der Anlage vollständig in den Eigenbetrieb über. Im Jahr der Übergabe wird der Contractor nur für die Dauer der Vorbereitungsphase vergütet."]
[null,"Eigenbetrieb\nWENN Jahr < Nutzungsdauer +1","Der Liegenschaftsnutzer betreibt und wartet die Anlagen in eigener Verantwortung und erhält die Energiekosteneinsparungen gemäß Energiesparprognose Eigenbetrieb (nach Ablauf des Contracting-Vertrages) selbst."]
[null,"Letztes Betriebsjahr\nWENN Jahr < Nutzungsdauer +2","Im letzten Betriebsjahr, bevor die Investitionen das Ende ihrer technischen Lebensdauer erreicht haben, fallen Einnahmen nur noch für die Monate der Vorbereitungsphase an."]

{"sheet":"Angebotsvergleich","index":2,"n_rows":432,"n_cols":30,"rows_kept":432,"cut":false,"hidden":false,"merged":[[41,15,41,16],[108,4,108,5],[108,10,108,11],[24,2,27,2]]}
[null,"Link zur Navigationseite"]
[]
[null,"Berechnungshilfe für die Angebotsbewertung und Wirtschaftlichkeitsuntersuchung im Energiespar-Contracting"]
[]
[null,"Angebotsvergleich Contracting-Anbieter: Berechnung Nettoeinsparungen und Kapitalwert"]
[]
["Projekt:","Testprojekt",null,"Eingabefelder"]
["Datum:","2016-01-01",null,"Eingabefelder/ Vorschlag Berechnungswerte"]
["Bearbeiter:","Testbearbeiter",null,"Berechnete Werte"]
[null,null,null,"Alle Kostenangaben netto"]
[]
[null,"Eingaben in diesem Blatt:"]
[null,"Zentrales Blatt für die Eingabe"]
[null,"- Berechnungsgrundlagen/ Parameter für die Wirtschaftlichkeitsbetrachtung"]
[null,"- Angebotsdaten"]
[null,"- Vergleichdaten mit Eigenbaumaßnahme"]
[null,"- Ersatzinvestitionen (bei Bedarf)"]
[]
[null,"Baseline:"]
[]
[null,"Tabelle 1: Berechnungsgrundlagen"]
[null,null,null,"Jährliche Preissteigerungsraten"]
[null,"Nutzungsdauer\nEnergiespar-\nmaßnahmen\n[a]","Referenzpreis\nCO2-Emissionen\n[€/t CO2]","Arbeit Elektroenergie\n[%]","Arbeit Heizenergie\n[%]","Wasser /Abwasser\n[%]","sonstige jährl. Kosten\n[%]","Investitionsgüter\n[%]","Betriebsführungs- kosten\n[%]","CO2-Emissionen\n[%]"]
[null,15,80]
[null,"VDI 2067 Blatt 1 (09/2012)","CO2-Einsparungen gehen monetär bewertet in den Kapitalwert ein.\n","Hier sind die in den Vergabeunterlagen veröffentlichten Parameter für die Wirtschaftlichkeitsbetrachtung/ Preissteigerungsfaktoren einzufügen."]
[null,"bietet Anhaltswerte in",null,"Vorschlagswerte mit Herleitung finden Sie im Internetportal des Kompetenzzentrums Contracting bei der dena: "]
[null,"Anhang A"]
[null,"Auszug siehe Tabelle 7",null,"https://www.kompetenzzentrum-contracting.de/umsetzungshilfen/tools-praxishilfen/"]
[null,"Durchschnittliche Einschätzung über alle Maßnahmen.\nBei Wärmeschutz verlängert sich die duchschnittliche Nutzungsdauer.\nMaximum für die Berechnungshilfe: 20 Jahre","Vorschlagswerte finden Sie im Internetportal."]
[]
[null,"Tabelle 2: Zinssätze für die Wirtschaftlichkeitsberechnung"]
[null,"Hier sind für die Wirtschaftlichkeitsbetrachtung die tagesaktuellen Zinssätze für börsennotierte Bundeswertpapiere (Zinsstrukturkurve) einzufügen."]
[null,"Als Zeitpunkt der Festlegung wird der Tag der Angebotsabgabe empfohlen"]
[null,"Link: www.bundesbank.de > Statistiken > Geld- und Kapitalmärkte > Zinsen und Renditen > Zinsstruktur am Rentenmarkt > Tabellen"]
[null,"Sollte dieser Link nicht mehr gültig sein, recherchieren Sie bitte in unseren Praxishilfen Energiespar-Contracting (beim Thema Angebotsbewertung)"]
[null,"http://www.kompetenzzentrum-contracting.de/praxishilfen/energiespar-contracting/"]
[null,"Angebotsabgabe",null,"[Datum TT.MM.JJJJ]"]
[null,"Jahr",1,2,3,4,5,6,7,8,9,10,11,12,13,14,15,16,17,18,19,20]
[null,"Zinssatz"]
[]
[]
[null,"Tabelle 3: Einspargarantie (Angebot Grobanalyse)",null,null,null,null,null,null,null,null,null,null,null,null,null,"In Bundesliegenschaften ist vor Start des Vergabeverfahrens die Zulässigkeit einer Netzeinspeisung  mit Vergütung gemäß EEG oder KWKG im Einzelfall zu prüfen."]
[null,"Anbieter [Namen eintragen]","Einsparung\nKosten\nElektroenergie\nNT [Euro/a]","Einsparung\nKosten \nElektroenergie\nHT [Euro/a]","Einsparung\nKosten \nLeistungsreduzierung\nElektroenergie\n[Euro/a]","Einsparung\nKosten der \nHeizenergie\n[Euro/a]","Einsparung \nKosten der\nLeistungsreduzierung\nHeizung\n[Euro/a]","Einsparung\nWasser\n[Euro/a]","Einsparung\nAbwasser\n[Euro/a]","Einspargarantie\nElektroenergie-Kosten\n[Euro/a]","Einspargarantie\nWärmeenergie-Kosten\n[Euro/a]","Einspargarantie\nWasser/Abwasser-Kosten\n[Euro/a]","Einsparung\nCO2-Emissionen\n[t CO2/a]","Einspargarantie\nsonstige jährliche Kosten\n[Euro/a]","Garantierte\nSteuerrückerstattung\n[Euro/a]","Garantierte\nEEG Vergütung\n[Euro/a]","Garantierte\nKWK Vergütung\n[Euro/a]","Errechnete Einspargarantie\nSumme der Kosten (im 0. Jahr)\n[Euro/a]","Einsparung geg. Baseline [%]","Investitionen des Contractors geg. Vergütung Contr. [%]"]
[null,"Anbieter 1",null,null,null,null,null,null,null,{"$f":"C44+D44+E44","v":0},{"$f":"F44+G44","v":0},{"$f":"H44+I44","v":0},null,null,null,null,null,{"$f":"SUM(J44:L44)+SUM(N44:Q44)","v":0},{"$f":"IF(AND(R44>0,$C$19>0),R44/$C$19,\"\")","v":""},{"$f":"IF(AND(C77>0,H77>0),(L77-N77)/(C77*H77),\"\")","v":""},{"$f":"IF(AND($C$19>0,R44>0),IF(OR(R44/$C$19<0.05,R44/$C$19>0.3),\"Hinweis: Überprüfung Einspargarantie (Wert kleiner als 5% oder größer als 30% gegenüber Baseline)!\",\"\"),\"\")","v":""}]
[null,"Anbieter 2",null,null,null,null,null,null,null,{"$f":"C45+D45+E45","v":0},{"$f":"F45+G45","v":0},{"$f":"H45+I45","v":0},null,null,null,null,null,{"$f":"SUM(J45:L45)+SUM(N45:Q45)","v":0},"","",""]
[null,"Anbieter 3",null,null,null,null,null,null,null,0,0,0,null,null,null,null,null,0,"","",""]
[null,"Anbieter 4",null,null,null,null,null,null,null,0,0,0,null,null,null,null,null,0,"","",""]
[null,"Anbieter 5",null,null,null,null,null,null,null,0,0,0,null,null,null,null,null,0,"","",""]
[null,"Anbieter 6",null,null,null,null,null,null,null,0,0,0,null,null,null,null,null,0,"","",""]
[null,"Anbieter 7",null,null,null,null,null,null,null,0,0,0,null,null,null,null,null,0,"","",""]
[null,"Anbieter 8",null,null,null,null,null,null,null,0,0,0,null,null,null,null,null,0,"","",""]
[null,"Anbieter 9",null,null,null,null,null,null,null,0,0,0,null,null,null,null,null,0,"","",""]
[null,"Anbieter 10",null,null,null,null,null,null,null,0,0,0,null,null,null,null,null,0,"","",""]
[null,"Anbieter 11",null,null,null,null,null,null,null,0,0,0,null,null,null,null,null,0,"","",""]
[null,"Anbieter 12",null,null,null,null,null,null,null,0,0,0,null,null,null,null,null,0,"","",""]
[null,"Anbieter 13",null,null,null,null,null,null,null,0,0,0,null,null,null,null,null,0,"","",""]
[null,"Anbieter 14",null,null,null,null,null,null,null,0,0,0,null,null,null,null,null,0,"","",""]
[null,"Anbieter 15",null,null,null,null,null,null,null,0,0,0,null,null,null,null,null,0,"","",""]
[null,"Anbieter 16",null,null,null,null,null,null,null,0,0,0,null,null,null,null,null,0,"","",""]
[null,"Anbieter 17",null,null,null,null,null,null,null,0,0,0,null,null,null,null,null,0,"","",""]
[null,"Anbieter 18",null,null,null,null,null,null,null,0,0,0,null,null,null,null,null,0,"","",""]
[null,"Anbieter 19",null,null,null,null,null,null,null,0,0,0,null,null,null,null,null,0,"","",""]
[null,"Anbieter 20",null,null,null,null,null,null,null,0,0,0,null,null,null,null,null,0,"","",""]
[null,"Anbieter 21",null,null,null,null,null,null,null,0,0,0,null,null,null,null,null,0,"","",""]
[null,"Anbieter 22",null,null,null,null,null,null,null,0,0,0,null,null,null,null,null,0,"","",""]
[null,"Anbieter 23",null,null,null,null,null,null,null,0,0,0,null,null,null,null,null,0,"","",""]
[null,"Anbieter 24",null,null,null,null,null,null,null,0,0,0,null,null,null,null,null,0,"","",""]
[null,"Anbieter 25",null,null,null,null,null,null,null,0,0,0,null,null,null,null,null,0,"","",""]
[null,"Anbieter 26",null,null,null,null,null,null,null,0,0,0,null,null,null,null,null,0,"","",""]
[null,"Anbieter 27",null,null,null,null,null,null,null,0,0,0,null,null,null,null,null,0,"","",""]
[null,"Anbieter 28",null,null,null,null,null,null,null,0,0,0,null,null,null,null,null,0,"","",""]
[null,"Anbieter 29",null,null,null,null,null,null,null,0,0,0,null,null,null,null,null,0,"","",""]
[null,"Anbieter 30",null,null,null,null,null,null,null,0,0,0,null,null,null,null,null,0,"","",""]
[]
[null,"Tabelle 4: Angebotskonditionen (Grobanalyse)"]
[null,"Anbieter","Dauer\nGarantiephase\n[Jahre]","Garantierte\nEnergiekosten-\neinsparung\n[Euro/a]","Beteiligung\nAuftragnehmer an \nGarantieeinsparung\n[%]","Grundvergütung\nAuftragnehmer \n[Euro]","Jährl. Finanzierungsbeitrag\nAuftraggeber \n[Euro]","Jährl. Vergütung\nAuftragnehmer \n[Euro]","Haushaltsentlastung\nAG \n[Euro]","Beteiligung\nAuftragnehmer an \nzusätzl. Einsparung\n[%]","Beteiligung\nAuftraggeber an \nzusätzl. Einsparung\n[%]","Investitionen in \ntechnische Geräte, Anlagen und Sachen\n[Euro]","Projektierungskosten\nFeinanalyse\n[Euro]","Einmaliger Baukostenzuschuss des Auftraggebers\n[Euro]","Beginn \nGarantiephase\n[MM/JJJJ]","Forfaitierter \nBetrag\n[Euro/Monat]","Maximal forfaitierbarer Betrag [€/Monat]","Forfaitierter Betrag in Vertragslaufzeit\n[€]","Anteil Forfaitierung an Grundvergütung\n[%]",null,null,null,null,null,null,null,null,null,"Hilfszellen zur Berechnung","Hilfszellen zur Berechnung"]
[null,{"$f":"B44","v":"Anbieter 1"},null,{"$f":"R44","v":0},null,{"$f":"D77*E77","v":0},null,{"$f":"F77+G77","v":0},{"$f":"D77-H77-G77","v":0},null,{"$f":"1-J77","v":1},null,null,null,null,null,{"$f":"L77/C77/12","v":{"$error":"#DIV/0!"}},{"$f":"IF(P77>0,P77*C77*12,\"\")","v":""},{"$f":"IF(H77*P77>0,12*P77/H77,\"\")","v":""},{"$f":"IF(P77>Q77,\"Maximal forfaitierbarer Betrag ist überschritten! Angebot prüfen/überarbeiten!\",\"\")","v":{"$error":"#DIV/0!"}},null,null,null,null,null,null,null,null,{"$f":"IF(AND(YEAR($O77)>2010,YEAR($O77)<2099),YEAR($O77),0)","v":0},{"$f":"MONTH($O77)","v":1}]
[null,"Anbieter 2",null,0,null,0,null,0,0,null,1,null,null,null,null,null,{"$error":"#DIV/0!"},{"$f":"IF(P78>0,P78*C78*12,\"\")","v":""},{"$f":"IF(H78*P78>0,12*P78/H78,\"\")","v":""},null,null,null,null,null,null,null,null,null,0,1]
[null,"Anbieter 3",null,0,null,0,null,0,0,null,1,null,null,null,null,null,{"$error":"#DIV/0!"},"",{"$f":"IF(H79*P79>0,12*P79/H79,\"\")","v":""},null,null,null,null,null,null,null,null,null,0,1]
[null,"Anbieter 4",null,0,null,0,null,0,0,null,1,null,null,null,null,null,{"$error":"#DIV/0!"},"","",null,null,null,null,null,null,null,null,null,0,1]
[null,"Anbieter 5",null,0,null,0,null,0,0,null,1,null,null,null,null,null,{"$error":"#DIV/0!"},"","",null,null,null,null,null,null,null,null,null,0,1]
[null,"Anbieter 6",null,0,null,0,null,0,0,null,1,null,null,null,null,null,{"$error":"#DIV/0!"},"","",null,null,null,null,null,null,null,null,null,0,1]
[null,"Anbieter 7",null,0,null,0,null,0,0,null,1,null,null,null,null,null,{"$error":"#DIV/0!"},"","",null,null,null,null,null,null,null,null,null,0,1]
[null,"Anbieter 8",null,0,null,0,null,0,0,null,1,null,null,null,null,null,{"$error":"#DIV/0!"},"","",null,null,null,null,null,null,null,null,null,0,1]
[null,"Anbieter 9",null,0,null,0,null,0,0,null,1,null,null,null,null,null,{"$error":"#DIV/0!"},"","",null,null,null,null,null,null,null,null,null,0,1]
[null,"Anbieter 10",null,0,null,0,null,0,0,null,1,null,null,null,null,null,{"$error":"#DIV/0!"},"","",null,null,null,null,null,null,null,null,null,0,1]
[null,"Anbieter 11",null,0,null,0,null,0,0,null,1,null,null,null,null,null,{"$error":"#DIV/0!"},"","",null,null,null,null,null,null,null,null,null,0,1]
[null,"Anbieter 12",null,0,null,0,null,0,0,null,1,null,null,null,null,null,{"$error":"#DIV/0!"},"","",null,null,null,null,null,null,null,null,null,0,1]
[null,"Anbieter 13",null,0,null,0,null,0,0,null,1,null,null,null,null,null,{"$error":"#DIV/0!"},"","",null,null,null,null,null,null,null,null,null,0,1]
[null,"Anbieter 14",null,0,null,0,null,0,0,null,1,null,null,null,null,null,{"$error":"#DIV/0!"},"","",null,null,null,null,null,null,null,null,null,0,1]
[null,"Anbieter 15",null,0,null,0,null,0,0,null,1,null,null,null,null,null,{"$error":"#DIV/0!"},"","",null,null,null,null,null,null,null,null,null,0,1]
[null,"Anbieter 16",null,0,null,0,null,0,0,null,1,null,null,null,null,null,{"$error":"#DIV/0!"},"","",null,null,null,null,null,null,null,null,null,0,1]
[null,"Anbieter 17",null,0,null,0,null,0,0,null,1,null,null,null,null,null,{"$error":"#DIV/0!"},"","",null,null,null,null,null,null,null,null,null,0,1]
[null,"Anbieter 18",null,0,null,0,null,0,0,null,1,null,null,null,null,null,{"$error":"#DIV/0!"},"","",null,null,null,null,null,null,null,null,null,0,1]
[null,"Anbieter 19",null,0,null,0,null,0,0,null,1,null,null,null,null,null,{"$error":"#DIV/0!"},"","",null,null,null,null,null,null,null,null,null,0,1]
[null,"Anbieter 20",null,0,null,0,null,0,0,null,1,null,null,null,null,null,{"$error":"#DIV/0!"},"","",null,null,null,null,null,null,null,null,null,0,1]
[null,"Anbieter 21",null,0,null,0,null,0,0,null,1,null,null,null,null,null,{"$error":"#DIV/0!"},"","",null,null,null,null,null,null,null,null,null,0,1]
[null,"Anbieter 22",null,0,null,0,null,0,0,null,1,null,null,null,null,null,{"$error":"#DIV/0!"},"","",null,null,null,null,null,null,null,null,null,0,1]
[null,"Anbieter 23",null,0,null,0,null,0,0,null,1,null,null,null,null,null,{"$error":"#DIV/0!"},"","",null,null,null,null,null,null,null,null,null,0,1]
[null,"Anbieter 24",null,0,null,0,null,0,0,null,1,null,null,null,null,null,{"$error":"#DIV/0!"},"","",null,null,null,null,null,null,null,null,null,0,1]
[null,"Anbieter 25",null,0,null,0,null,0,0,null,1,null,null,null,null,null,{"$error":"#DIV/0!"},"","",null,null,null,null,null,null,null,null,null,0,1]
[null,"Anbieter 26",null,0,null,0,null,0,0,null,1,null,null,null,null,null,{"$error":"#DIV/0!"},"","",null,null,null,null,null,null,null,null,null,0,1]
[null,"Anbieter 27",null,0,null,0,null,0,0,null,1,null,null,null,null,null,{"$error":"#DIV/0!"},"","",null,null,null,null,null,null,null,null,null,0,1]
[null,"Anbieter 28",null,0,null,0,null,0,0,null,1,null,null,null,null,null,{"$error":"#DIV/0!"},"","",null,null,null,null,null,null,null,null,null,0,1]
[null,"Anbieter 29",null,0,null,0,null,0,0,null,1,null,null,null,null,null,{"$error":"#DIV/0!"},"","",null,null,null,null,null,null,null,null,null,0,1]
[null,"Anbieter 30",null,0,null,0,null,0,0,null,1,null,null,null,null,null,{"$error":"#DIV/0!"},"","",null,null,null,null,null,null,null,null,null,0,1]
[]
[null,"Tabelle 5: Eigenbetrieb",null,null,null,null,null,null,"Tabelle 6: Ersatzinvestition nach Vertragsende"]
[null,"Anbieter","Einsparprognose\nEigenbetrieb\nnach Vertragsende\n[%]","Jährl. Wartungs- und Instandhaltungs-\nkosten bezogen auf\nInvestitionskosten\n[%]","Wartungs- und Instandhaltungskosten variieren je nach eingesetzter Technik. Prozentwerte können der VDI 2067 Blatt 1, Anhang A entnommen werden, Auszug siehe Tabelle 7",null,null,null,"Investition des AG nach Vertragsende zur Aufrechterhaltung der Einsparung \n(Wert zum Zeitpunkt des Angebotes)\n[€]","Nutzungsdauer der Ersatzinvestition \n[a]","Erhaltungsinvestitionen sind zu berücksichtigen, wenn die Nutzungsdauer von Einzelmaßnahmen kürzer ist als die durchschnittliche Nutzungsdauer (siehe oben, Tabelle 1). Dies kann z. B. bei einem BHKW der Fall sein. Nähere Erläuterung siehe Leitfaden."]
[null,{"$f":"B77","v":"Anbieter 1"},{"$f":"IF(R44>0,70%+IF((L77/(R44*C77)/0.5)<1,(L77/(R44*C77)/0.5),1)*(20%),)","v":0}]
[null,"Anbieter 2",0]
[null,"Anbieter 3",0]
[null,"Anbieter 4",0]
[null,"Anbieter 5",0]
[null,"Anbieter 6",0]
[null,"Anbieter 7",0]
[null,"Anbieter 8",0]
[null,"Anbieter 9",0]
[null,"Anbieter 10",0]
[null,"Anbieter 11",0]
[null,"Anbieter 12",0]
[null,"Anbieter 13",0]
[null,"Anbieter 14",0]
[null,"Anbieter 15",0]
[null,"Anbieter 16",0]
[null,"Anbieter 17",0]
[null,"Anbieter 18",0]
[null,"Anbieter 19",0]
[null,"Anbieter 20",0]
[null,"Anbieter 21",0]
[null,"Anbieter 22",0]
[null,"Anbieter 23",0]
[null,"Anbieter 24",0]
[null,"Anbieter 25",0]
[null,"Anbieter 26",0]
[null,"Anbieter 27",0]
[null,"Anbieter 28",0]
[null,"Anbieter 29",0]
[null,"Anbieter 30",0]
[]
[]
[null,"Tabelle 7"]
[null,"Beispiele für Nutzungsdauer, Instandhaltungsaufwand auf Grundlage der VDI 2067 Blatt 1"]
[null,"Wirtschaftlichkeit gebäudetechnischer Anlagen Grundlagen und Kostenberechnung (09/2012)"]
[null,"VDI 2067 Bl. 1 Anhang A: Rechnerische Nutzungsdauer sowie Aufwand für Inspektion, Wartung und Instandsetzung und Bedienen von"]
[null,"A2. Heizungsanlagen"]
[null,"A3. Raumlufttechnischen Anlagen"]
[null,"A4. Anlagen für erwärmtes Trinkwasser"]
[null,"A5. Gebäudeautomation"]
[]
[null,"Tabelle","Anlagenkomponente\n(Beispiel)","Rechnerische Nutzungsdauer\n[Jahre]","Aufwand Instandsetzung \n[%]","Aufwand Wartung und Inspektion\n[%]"]
[null,"A2","Spezialheizkessel über 120 kW",20,2,2]
[null,"A3","Rotations-Wärmetauscher",15,3,10]
[null,"A4","Elektronisch geregelter Durchlauferhitzer",15,1,1]
[null,"A5","Regler",10,10,5]
[]
[]
[null,"Angebotsvergleich"]
[null,"Jahr 0 =",{"$f":"MIN(AC77:AC78)-1","v":-1}]
[null,"lfd. Jahr",0,1,2,3,4,5,6,7,8,9,10,11,12,13,14,15,16,17,18,19,20]
[null,"Jahr",{"$f":"C159","v":-1},{"$f":"C161+1","v":0},1,2,3,4,{"$f":"H161+1","v":5},6,7,8,9,10,11,12,13,14,15,16,17,{"$f":"U161+1","v":18},{"$f":"V161+1","v":19}]
[null,"Erläuterung:","0. Jahr = das Jahr vor Beginn der Garantiephase (Umbauphase). Im Jahr 0 erfolgt keine Diskontierung. Einziger Zahlungsstrom im 0. Jahr ist der Baukostenzuschuss.","1. Jahr = Beginn der Garantiephase. Die Energiekosten-einsparung wird im 1. Jahr nur anteilig berechnet."]
[null,null,null,null,null,null,null,null,null,null,null,null,null,null,null,null,null,null,null,null,null,null,null,null,null,"Kapitalwert"]
[null,{"$f":"B$44","v":"Anbieter 1"},null,null,null,null,null,null,null,null,null,null,null,null,null,null,null,null,null,null,null,null,null,null,null,"Summe"]
[null,"Einspargarantie Kosten",null,{"$f":"IF($AC77>0,\nIF(D$161<$AC77,0,\nIF($AC77=D$161,(13-$AD77)/12,\nIF(($AC77+$C77)>D$161,1,\nIF(($AC77+$C77)=D$161,(($AD77-1)/12+(13-$AD77)/12*$C110),\nIF(($AC77+Nutzungsdauer)>D$161,$C110,\nIF(($AC77+Nutzungsdauer)=D$161,($AD77-1)/12*$C110,\n0)))))),0)\n*($J44*(1+$D$24)^D$160+$K44*(1+$E$24)^D$160+$L44*(1+$F$24)^D$160+$N44*(1+$G$24)^D$160+SUM($O44:$Q44))","v":0},0,0,0,0,0,0,0,0,0,0,0,0,0,0,0,0,0,0,0]
[null,"Einsparung Instandhaltung",null,{"$f":"IF($AC77>0,\nIF(D$161<$AC77,0,\nIF($AC77=D$161,(13-$AD77)/12,\nIF(($AC77+$C77)>D$161,1,\nIF(($AC77+$C77)=D$161,(($AD77-1)/12),\n0)))),0)\n*($D110*$L77)*(1+$I$24)^D$160","v":0},0,0,0,0,0,0,0,0,0,0,0,0,0,0,0,0,0,0,0]
[null,"Vergütung Contractor (inkl. Baukostenzuschuss im Jahr 0)",{"$f":"-$N$77","v":0},{"$f":"IF($AC77>0,\nIF(D$161<$AC77,0,\nIF($AC77=D$161,(13-$AD77)/12,\nIF(($AC77+$C77)>D$161,1,\nIF(($AC77+$C77)=D$161,(($AD77-1)/12),\n0)))),0)\n*-$H77","v":0},0,0,0,0,0,0,0,0,0,0,0,0,0,0,0,0,0,0,0]
[null,"Ersatzinvestition inkl. deren Restwert am Ende des Betrachtungszeitraums",null,{"$f":"IF(AND($AC$77>0,$I$110>0),\nIF($C$77<Nutzungsdauer,\nIF(D$161=$AC$77+$C$77,-$I$110*(1+r_invest)^D$160,\nIF(D$161=$AC$77+Nutzungsdauer,$I$110*(1+r_invest)^D$160*($J$110-(Nutzungsdauer-$C$77))/$J$110,0)),0),0)","v":0},{"$f":"IF(AND($AC$77>0,$I$110>0),\nIF($C$77<Nutzungsdauer,\nIF(E$161=$AC$77+$C$78,-$I$110*(1+r_invest)^E$160,\nIF(E$161=$AC$77+Nutzungsdauer,$I$110*(1+r_invest)^E$160*($J$110-(Nutzungsdauer-$C$77))/$J$110,0)),0),0)","v":0},0,0,0,0,0,0,0,0,0,0,0,0,0,0,0,0,0,0]
[null,"Einsparung CO2-Emissionen",null,{"$f":"IF($AC77>0,\nIF(D$161<$AC77,0,\nIF($AC77=D$161,(13-$AD77)/12,\nIF(($AC77+$C77)>D$161,1,\nIF(($AC77+$C77)=D$161,(($AD77-1)/12+(13-$AD77)/12*$C110),\nIF(($AC77+Nutzungsdauer)>D$161,$C110,\nIF(($AC77+Nutzungsdauer)=D$161,($AD77-1)/12*$C110,\n0)))))),0)\n*($M44*$C$24*(1+$J$24)^D$160)","v":0},0,0,0,0,0,0,0,0,0,0,0,0,0,0,0,0,0,0,0]
[null,"Nettoersparnis",{"$f":"SUM(C165:C169)","v":0},0,0,0,0,0,{"$f":"SUM(I165:I169)","v":0},0,0,0,0,0,0,0,0,0,0,0,0,{"$f":"SUM(V165:V169)","v":0},{"$f":"SUM(W165:W169)","v":0}]
[null,"Nettoeinsparung diskontiert (Barwert)",{"$f":"C170","v":0},{"$f":"D170*(1+C$39)^-D$160","v":0},0,0,0,0,0,0,0,0,0,0,0,0,0,0,0,0,0,0,0,null,null,{"$f":"SUM(C171:W171)","v":0}]
[]
[null,{"$f":"B$45","v":"Anbieter 2"}]
[null,{"$f":"$B$165","v":"Einspargarantie Kosten"},null,{"$f":"IF($AC78>0,\nIF(D161<$AC78,0,\nIF($AC78=D161,(13-$AD78)/12,\nIF(($AC78+$C78)>D161,1,\nIF(($AC78+$C78)=D161,(($AD78-1)/12+(13-$AD78)/12*$C111),\nIF(($AC78+Nutzungsdauer)>D161,$C111,\nIF(($AC78+Nutzungsdauer)=D161,($AD78-1)/12*$C111,\n0)))))),0)\n*($J$45*(1+$D$24)^D$160+$K$45*(1+$E$24)^D$160+$L$45*(1+$F$24)^D$160+$N$45*(1+$G$24)^D$160+SUM($O$45:$Q$45))","v":0},0,0,0,0,0,0,0,0,0,0,0,0,0,0,0,0,0,0,0]
[null,{"$f":"$B$166","v":"Einsparung Instandhaltung"},null,{"$f":"IF($AC78>0,\nIF(D$161<$AC78,0,\nIF($AC78=D$161,(13-$AD78)/12,\nIF(($AC78+$C78)>D$161,1,\nIF(($AC78+$C78)=D$161,(($AD78-1)/12),\n0)))),0)\n*($D111*$L78)*(1+$I$24)^D$160","v":0},0,0,0,0,0,0,0,0,0,0,0,0,0,0,0,0,0,0,0]
[null,{"$f":"$B$167","v":"Vergütung Contractor (inkl. Baukostenzuschuss im Jahr 0)"},{"$f":"-$N$78","v":0},{"$f":"IF($AC78>0,\nIF(D$161<$AC78,0,\nIF($AC78=D$161,(13-$AD78)/12,\nIF(($AC78+$C78)>D$161,1,\nIF(($AC78+$C78)=D$161,(($AD78-1)/12),\n0)))),0)\n*-$H78","v":0},0,0,0,0,0,0,0,0,0,0,0,0,0,0,0,0,0,0,0]
[null,{"$f":"$B$168","v":"Ersatzinvestition inkl. deren Restwert am Ende des Betrachtungszeitraums"},null,{"$f":"IF(AND($AC$78>0,$I$111>0),\nIF($C$78<Nutzungsdauer,\nIF(D$161=$AC$78+$C$78,-$I$111*(1+r_invest)^D$160,\nIF(D$161=$AC$78+Nutzungsdauer,$I$111*(1+r_invest)^D$160*($J$111-(Nutzungsdauer-$C$78))/$J$111,0)),0),0)","v":0},0,0,0,0,0,0,0,0,0,0,0,0,0,0,0,0,0,0,0]
[null,"Einsparung CO2-Emissionen",null,{"$f":"IF($AC78>0,\nIF(D$161<$AC78,0,\nIF($AC78=D$161,(13-$AD78)/12,\nIF(($AC78+$C78)>D$161,1,\nIF(($AC78+$C78)=D$161,(($AD78-1)/12+(13-$AD78)/12*$C111),\nIF(($AC78+Nutzungsdauer)>D$161,$C111,\nIF(($AC78+Nutzungsdauer)=D$161,($AD78-1)/12*$C111,\n0)))))),0)\n*($M45*$C$24*(1+$J$24)^D$160)","v":0},0,0,0,0,0,0,0,0,0,0,0,0,0,0,0,0,0,0,0]
[null,{"$f":"$B$170","v":"Nettoersparnis"},{"$f":"SUM(C174:C178)","v":0},0,0,0,0,0,0,0,0,0,0,0,0,0,0,0,0,0,{"$f":"SUM(U174:U178)","v":0},{"$f":"SUM(V174:V178)","v":0},{"$f":"SUM(W174:W178)","v":0}]
[null,"Nettoeinsparung diskontiert (Barwert)",{"$f":"C179","v":0},{"$f":"D179*(1+C$39)^-D$160","v":0},0,0,0,0,0,0,0,0,0,0,0,0,0,0,0,0,0,0,0,null,null,{"$f":"SUM(C180:W180)","v":0}]
[]
[null,{"$f":"B$46","v":"Anbieter 3"}]
[null,{"$f":"$B$165","v":"Einspargarantie Kosten"},null,{"$f":"IF($AC79>0,\nIF(D$161<$AC79,0,\nIF($AC79=D$161,(13-$AD79)/12,\nIF(($AC79+$C79)>D$161,1,\nIF(($AC79+$C79)=D$161,(($AD79-1)/12+(13-$AD79)/12*$C112),\nIF(($AC79+Nutzungsdauer)>D$161,$C112,\nIF(($AC79+Nutzungsdauer)=D$161,($AD79-1)/12*$C112,\n0)))))),0)\n*($J46*(1+$D$24)^D$160+$K46*(1+$E$24)^D$160+$L46*(1+$F$24)^D$160+$N46*(1+$G$24)^D$160+SUM($O46:$Q46))","v":0},0,0,0,0,0,0,0,0,0,0,0,0,0,0,0,0,0,0,0]
[null,{"$f":"$B$166","v":"Einsparung Instandhaltung"},null,{"$f":"IF($AC79>0,\nIF(D$161<$AC79,0,\nIF($AC79=D$161,(13-$AD79)/12,\nIF(($AC79+$C79)>D$161,1,\nIF(($AC79+$C79)=D$161,(($AD79-1)/12),\n0)))),0)\n*($D112*$L79)*(1+$I$24)^D$160","v":0},0,0,0,0,0,0,0,0,0,0,0,0,0,0,0,0,0,0,0]
[null,{"$f":"$B$167","v":"Vergütung Contractor (inkl. Baukostenzuschuss im Jahr 0)"},{"$f":"-$N$79","v":0},{"$f":"IF($AC79>0,\nIF(D$161<$AC79,0,\nIF($AC79=D$161,(13-$AD79)/12,\nIF(($AC79+$C79)>D$161,1,\nIF(($AC79+$C79)=D$161,(($AD79-1)/12),\n0)))),0)\n*-$H79","v":0},0,0,0,0,0,0,0,0,0,0,0,0,0,0,0,0,0,0,0]
[null,{"$f":"$B$168","v":"Ersatzinvestition inkl. deren Restwert am Ende des Betrachtungszeitraums"},null,{"$f":"IF(AND($AC$79>0,$I$112>0),\nIF($C$79<Nutzungsdauer,\nIF(D$161=$AC$79+$C$79,-$I$112*(1+r_invest)^D$160,\nIF(D$161=$AC$79+Nutzungsdauer,$I$112*(1+r_invest)^D$160*($J$112-(Nutzungsdauer-$C$79))/$J$112,0)),0),0)","v":0},0,0,0,0,0,0,0,0,0,0,0,0,0,0,0,0,0,0,0]
[null,"Einsparung CO2-Emissionen",null,{"$f":"IF($AC79>0,\nIF(D$161<$AC79,0,\nIF($AC79=D$161,(13-$AD79)/12,\nIF(($AC79+$C79)>D$161,1,\nIF(($AC79+$C79)=D$161,(($AD79-1)/12+(13-$AD79)/12*$C112),\nIF(($AC79+Nutzungsdauer)>D$161,$C112,\nIF(($AC79+Nutzungsdauer)=D$161,($AD79-1)/12*$C112,\n0)))))),0)\n*($M46*$C$24*(1+$J$24)^D$160)","v":0},0,0,0,0,0,0,0,0,0,0,0,0,0,0,0,0,0,0,0]
[null,{"$f":"$B$170","v":"Nettoersparnis"},{"$f":"SUM(C183:C187)","v":0},0,0,0,0,0,0,0,0,0,0,0,0,0,0,0,0,0,{"$f":"SUM(U183:U187)","v":0},{"$f":"SUM(V183:V187)","v":0},{"$f":"SUM(W183:W187)","v":0}]
[null,"Nettoeinsparung diskontiert (Barwert)",{"$f":"C188","v":0},{"$f":"D188*(1+C$39)^-D$160","v":0},0,0,0,0,0,0,0,0,0,0,0,0,0,0,0,0,0,0,0,null,null,{"$f":"SUM(C189:W189)","v":0}]
[]
[null,{"$f":"B$47","v":"Anbieter 4"}]
[null,{"$f":"$B$165","v":"Einspargarantie Kosten"},null,{"$f":"IF($AC80>0,\nIF(D$161<$AC80,0,\nIF($AC80=D$161,(13-$AD80)/12,\nIF(($AC80+$C80)>D$161,1,\nIF(($AC80+$C80)=D$161,(($AD80-1)/12+(13-$AD80)/12*$C113),\nIF(($AC80+Nutzungsdauer)>D$161,$C113,\nIF(($AC80+Nutzungsdauer)=D$161,($AD80-1)/12*$C113,\n0)))))),0)\n*($J47*(1+$D$24)^D$160+$K47*(1+$E$24)^D$160+$L47*(1+$F$24)^D$160+$N47*(1+$G$24)^D$160+SUM($O47:$Q47))","v":0},0,0,0,0,0,0,0,0,0,0,0,0,0,0,0,0,0,0,0]
[null,{"$f":"$B$166","v":"Einsparung Instandhaltung"},null,{"$f":"IF($AC80>0,\nIF(D$161<$AC80,0,\nIF($AC80=D$161,(13-$AD80)/12,\nIF(($AC80+$C80)>D$161,1,\nIF(($AC80+$C80)=D$161,(($AD80-1)/12),\n0)))),0)\n*($D113*$L80)*(1+$I$24)^D$160","v":0},0,0,0,0,0,0,0,0,0,0,0,0,0,0,0,0,0,0,0]
[null,{"$f":"$B$167","v":"Vergütung Contractor (inkl. Baukostenzuschuss im Jahr 0)"},{"$f":"-$N$80","v":0},{"$f":"IF($AC80>0,\nIF(D$161<$AC80,0,\nIF($AC80=D$161,(13-$AD80)/12,\nIF(($AC80+$C80)>D$161,1,\nIF(($AC80+$C80)=D$161,(($AD80-1)/12),\n0)))),0)\n*-$H80","v":0},0,0,0,0,0,0,0,0,0,0,0,0,0,0,0,0,0,0,0]
[null,{"$f":"$B$168","v":"Ersatzinvestition inkl. deren Restwert am Ende des Betrachtungszeitraums"},null,{"$f":"IF(AND($AC$80>0,$I$113>0),\nIF($C$80<Nutzungsdauer,\nIF(D$161=$AC$80+$C$80,-$I$113*(1+r_invest)^D$160,\nIF(D$161=$AC$80+Nutzungsdauer,$I$113*(1+r_invest)^D$160*($J$113-(Nutzungsdauer-$C$80))/$J$113,0)),0),0)","v":0},0,0,0,0,0,0,0,0,0,0,0,0,0,0,0,0,0,0,0]
[null,"Einsparung CO2-Emissionen",null,{"$f":"IF($AC80>0,\nIF(D$161<$AC80,0,\nIF($AC80=D$161,(13-$AD80)/12,\nIF(($AC80+$C80)>D$161,1,\nIF(($AC80+$C80)=D$161,(($AD80-1)/12+(13-$AD80)/12*$C113),\nIF(($AC80+Nutzungsdauer)>D$161,$C113,\nIF(($AC80+Nutzungsdauer)=D$161,($AD80-1)/12*$C113,\n0)))))),0)\n*($M47*$C$24*(1+$J$24)^D$160)","v":0},0,0,0,0,0,0,0,0,0,0,0,0,0,0,0,0,0,0,0]
[null,{"$f":"$B$170","v":"Nettoersparnis"},{"$f":"SUM(C192:C196)","v":0},0,0,0,0,0,0,0,0,0,0,0,0,0,0,0,0,0,{"$f":"SUM(U192:U196)","v":0},{"$f":"SUM(V192:V196)","v":0},{"$f":"SUM(W192:W196)","v":0}]
[null,"Nettoeinsparung diskontiert (Barwert)",{"$f":"C197","v":0},{"$f":"D197*(1+C$39)^-D$160","v":0},0,0,0,0,0,0,0,0,0,0,0,0,0,0,0,0,0,0,0,null,null,{"$f":"SUM(C198:W198)","v":0}]
[]
[null,{"$f":"B$48","v":"Anbieter 5"}]
[null,{"$f":"$B$165","v":"Einspargarantie Kosten"},null,{"$f":"IF($AC81>0,\nIF(D$161<$AC81,0,\nIF($AC81=D$161,(13-$AD81)/12,\nIF(($AC81+$C81)>D$161,1,\nIF(($AC81+$C81)=D$161,(($AD81-1)/12+(13-$AD81)/12*$C114),\nIF(($AC81+Nutzungsdauer)>D$161,$C114,\nIF(($AC81+Nutzungsdauer)=D$161,($AD81-1)/12*$C114,\n0)))))),0)\n*($J48*(1+$D$24)^D$160+$K48*(1+$E$24)^D$160+$L48*(1+$F$24)^D$160+$N48*(1+$G$24)^D$160+SUM($O48:$Q48))","v":0},0,0,0,0,0,0,0,0,0,0,0,0,0,0,0,0,0,0,0]
[null,{"$f":"$B$166","v":"Einsparung Instandhaltung"},null,{"$f":"IF($AC81>0,\nIF(D$161<$AC81,0,\nIF($AC81=D$161,(13-$AD81)/12,\nIF(($AC81+$C81)>D$161,1,\nIF(($AC81+$C81)=D$161,(($AD81-1)/12),\n0)))),0)\n*($D114*$L81)*(1+$I$24)^D$160","v":0},0,0,0,0,0,0,0,0,0,0,0,0,0,0,0,0,0,0,0]
[null,{"$f":"$B$167","v":"Vergütung Contractor (inkl. Baukostenzuschuss im Jahr 0)"},{"$f":"-$N$81","v":0},{"$f":"IF($AC81>0,\nIF(D$161<$AC81,0,\nIF($AC81=D$161,(13-$AD81)/12,\nIF(($AC81+$C81)>D$161,1,\nIF(($AC81+$C81)=D$161,(($AD81-1)/12),\n0)))),0)\n*-$H81","v":0},0,0,0,0,0,0,0,0,0,0,0,0,0,0,0,0,0,0,0]
[null,{"$f":"$B$168","v":"Ersatzinvestition inkl. deren Restwert am Ende des Betrachtungszeitraums"},null,{"$f":"IF(AND($AC$81>0,$I$114>0),\nIF($C$81<Nutzungsdauer,\nIF(D$161=$AC$81+$C$81,-$I$114*(1+r_invest)^D$160,\nIF(D$161=$AC$81+Nutzungsdauer,$I$114*(1+r_invest)^D$160*($J$114-(Nutzungsdauer-$C$81))/$J$114,0)),0),0)","v":0},0,0,0,0,0,0,0,0,0,0,0,0,0,0,{"$f":"IF(AND($AC$81>0,$I$114>0),\nIF($C$81<Nutzungsdauer,\nIF(S$161=$AC$81+$C$81,-$I$114*(1+r_invest)^S$160,\nIF(S$161=$AC$81+Nutzungsdauer,$I$114*(1+r_invest)^S$160*($J$114-(Nutzungsdauer-$C$81))/$J$114,0)),0),0)","v":0},0,0,0,0]
[null,"Einsparung CO2-Emissionen",null,{"$f":"IF($AC81>0,\nIF(D$161<$AC81,0,\nIF($AC81=D$161,(13-$AD81)/12,\nIF(($AC81+$C81)>D$161,1,\nIF(($AC81+$C81)=D$161,(($AD81-1)/12+(13-$AD81)/12*$C114),\nIF(($AC81+Nutzungsdauer)>D$161,$C114,\nIF(($AC81+Nutzungsdauer)=D$161,($AD81-1)/12*$C114,\n0)))))),0)\n*($M48*$C$24*(1+$J$24)^D$160)","v":0},0,0,0,0,0,0,0,0,0,0,0,0,0,0,0,0,0,0,0]
[null,{"$f":"$B$170","v":"Nettoersparnis"},{"$f":"SUM(C201:C205)","v":0},0,0,0,0,0,0,0,0,0,0,0,0,0,0,0,0,0,{"$f":"SUM(U201:U205)","v":0},{"$f":"SUM(V201:V205)","v":0},{"$f":"SUM(W201:W205)","v":0}]
[null,"Nettoeinsparung diskontiert (Barwert)",{"$f":"C206","v":0},{"$f":"D206*(1+C$39)^-D$160","v":0},0,0,0,0,0,0,0,0,0,0,0,0,0,0,{"$f":"S206*(1+R$39)^-S$160","v":0},0,0,0,0,null,null,{"$f":"SUM(C207:W207)","v":0}]
[]
[null,{"$f":"B$49","v":"Anbieter 6"}]
[null,{"$f":"$B$165","v":"Einspargarantie Kosten"},null,{"$f":"IF($AC82>0,\nIF(D$161<$AC82,0,\nIF($AC82=D$161,(13-$AD82)/12,\nIF(($AC82+$C82)>D$161,1,\nIF(($AC82+$C82)=D$161,(($AD82-1)/12+(13-$AD82)/12*$C115),\nIF(($AC82+Nutzungsdauer)>D$161,$C115,\nIF(($AC82+Nutzungsdauer)=D$161,($AD82-1)/12*$C115,\n0)))))),0)\n*($J49*(1+$D$24)^D$160+$K49*(1+$E$24)^D$160+$L49*(1+$F$24)^D$160+$N49*(1+$G$24)^D$160+SUM($O49:$Q49))","v":0},0,0,0,0,0,0,0,0,0,0,0,0,0,0,0,0,0,0,0]
[null,{"$f":"$B$166","v":"Einsparung Instandhaltung"},null,{"$f":"IF($AC82>0,\nIF(D$161<$AC82,0,\nIF($AC82=D$161,(13-$AD82)/12,\nIF(($AC82+$C82)>D$161,1,\nIF(($AC82+$C82)=D$161,(($AD82-1)/12),\n0)))),0)\n*($D115*$L82)*(1+$I$24)^D$160","v":0},0,0,0,0,0,0,0,0,0,0,0,0,0,0,0,0,0,0,0]
[null,{"$f":"$B$167","v":"Vergütung Contractor (inkl. Baukostenzuschuss im Jahr 0)"},{"$f":"-$N$82","v":0},{"$f":"IF($AC82>0,\nIF(D$161<$AC82,0,\nIF($AC82=D$161,(13-$AD82)/12,\nIF(($AC82+$C82)>D$161,1,\nIF(($AC82+$C82)=D$161,(($AD82-1)/12),\n0)))),0)\n*-$H82","v":0},0,0,0,0,0,0,0,0,0,0,0,0,0,0,0,0,0,0,0]
[null,{"$f":"$B$168","v":"Ersatzinvestition inkl. deren Restwert am Ende des Betrachtungszeitraums"},null,{"$f":"IF(AND($AC$82>0,$I$115>0),\nIF($C$82<Nutzungsdauer,\nIF(D$161=$AC$82+$C$82,-$I$115*(1+r_invest)^D$160,\nIF(D$161=$AC$82+Nutzungsdauer,$F$82*(1+r_invest)^D$160*($J$115-(Nutzungsdauer-$C$82))/$J$115,0)),0),0)","v":0},0,0,0,0,0,0,0,0,0,0,0,0,0,0,{"$f":"IF(AND($AC$82>0,$I$115>0),\nIF($C$82<Nutzungsdauer,\nIF(S$161=$AC$82+$C$82,-$I$115*(1+r_invest)^S$160,\nIF(S$161=$AC$82+Nutzungsdauer,$I$115*(1+r_invest)^S$160*($J$115-(Nutzungsdauer-$C$82))/$J$115,0)),0),0)","v":0},0,0,0,0]
[null,"Einsparung CO2-Emissionen",null,{"$f":"IF($AC82>0,\nIF(D$161<$AC82,0,\nIF($AC82=D$161,(13-$AD82)/12,\nIF(($AC82+$C82)>D$161,1,\nIF(($AC82+$C82)=D$161,(($AD82-1)/12+(13-$AD82)/12*$C115),\nIF(($AC82+Nutzungsdauer)>D$161,$C115,\nIF(($AC82+Nutzungsdauer)=D$161,($AD82-1)/12*$C115,\n0)))))),0)\n*($M49*$C$24*(1+$J$24)^D$160)","v":0},0,0,0,0,0,0,0,0,0,0,0,0,0,0,0,0,0,0,0]
[null,{"$f":"$B$170","v":"Nettoersparnis"},{"$f":"SUM(C210:C214)","v":0},0,0,0,0,0,0,0,0,0,0,0,0,0,0,0,0,0,{"$f":"SUM(U210:U214)","v":0},{"$f":"SUM(V210:V214)","v":0},{"$f":"SUM(W210:W214)","v":0}]
[null,"Nettoeinsparung diskontiert (Barwert)",{"$f":"C215","v":0},{"$f":"D215*(1+C$39)^-D$160","v":0},0,0,0,0,0,0,0,0,0,0,0,0,0,0,0,0,0,0,0,null,null,{"$f":"SUM(C216:W216)","v":0}]
[]
[null,{"$f":"B$50","v":"Anbieter 7"}]
[null,{"$f":"$B$165","v":"Einspargarantie Kosten"},null,{"$f":"IF($AC83>0,\nIF(D$161<$AC83,0,\nIF($AC83=D$161,(13-$AD83)/12,\nIF(($AC83+$C83)>D$161,1,\nIF(($AC83+$C83)=D$161,(($AD83-1)/12+(13-$AD83)/12*$C116),\nIF(($AC83+Nutzungsdauer)>D$161,$C116,\nIF(($AC83+Nutzungsdauer)=D$161,($AD83-1)/12*$C116,\n0)))))),0)\n*($J50*(1+$D$24)^D$160+$K50*(1+$E$24)^D$160+$L50*(1+$F$24)^D$160+$N50*(1+$G$24)^D$160+SUM($O50:$Q50))","v":0},0,0,0,0,0,0,0,0,0,0,0,0,0,0,0,0,0,0,0]
[null,{"$f":"$B$166","v":"Einsparung Instandhaltung"},null,{"$f":"IF($AC83>0,\nIF(D$161<$AC83,0,\nIF($AC83=D$161,(13-$AD83)/12,\nIF(($AC83+$C83)>D$161,1,\nIF(($AC83+$C83)=D$161,(($AD83-1)/12),\n0)))),0)\n*($D116*$L83)*(1+$I$24)^D$160","v":0},0,0,0,0,0,0,0,0,0,0,0,0,0,0,0,0,0,0,0]
[null,{"$f":"$B$167","v":"Vergütung Contractor (inkl. Baukostenzuschuss im Jahr 0)"},{"$f":"-$N$83","v":0},{"$f":"IF($AC83>0,\nIF(D$161<$AC83,0,\nIF($AC83=D$161,(13-$AD83)/12,\nIF(($AC83+$C83)>D$161,1,\nIF(($AC83+$C83)=D$161,(($AD83-1)/12),\n0)))),0)\n*-$H83","v":0},0,0,0,0,0,0,0,0,0,0,0,0,0,0,0,0,0,0,0]
[null,{"$f":"$B$168","v":"Ersatzinvestition inkl. deren Restwert am Ende des Betrachtungszeitraums"},null,{"$f":"IF(AND($AC$83>0,$I$116>0),\nIF($C$83<Nutzungsdauer,\nIF(D$161=$AC$83+$C$83,-$I$116*(1+r_invest)^D$160,\nIF(D$161=$AC$83+Nutzungsdauer,$F$83*(1+r_invest)^D$160*($J$116-(Nutzungsdauer-$C$83))/$J$116,0)),0),0)","v":0},0,0,0,0,0,0,0,0,0,0,0,0,0,0,{"$f":"IF(AND($AC$83>0,$I$116>0),\nIF($C$83<Nutzungsdauer,\nIF(S$161=$AC$83+$C$83,-$I$116*(1+r_invest)^S$160,\nIF(S$161=$AC$83+Nutzungsdauer,$I$116*(1+r_invest)^S$160*($J$116-(Nutzungsdauer-$C$83))/$J$116,0)),0),0)","v":0},0,0,0,0]
[null,"Einsparung CO2-Emissionen",null,{"$f":"IF($AC83>0,\nIF(D$161<$AC83,0,\nIF($AC83=D$161,(13-$AD83)/12,\nIF(($AC83+$C83)>D$161,1,\nIF(($AC83+$C83)=D$161,(($AD83-1)/12+(13-$AD83)/12*$C116),\nIF(($AC83+Nutzungsdauer)>D$161,$C116,\nIF(($AC83+Nutzungsdauer)=D$161,($AD83-1)/12*$C116,\n0)))))),0)\n*($M50*$C$24*(1+$J$24)^D$160)","v":0},0,0,0,0,0,0,0,0,0,0,0,0,0,0,0,0,0,0,0]
[null,{"$f":"$B$170","v":"Nettoersparnis"},{"$f":"SUM(C219:C223)","v":0},0,0,0,0,0,0,0,0,0,0,0,0,0,0,0,0,0,{"$f":"SUM(U219:U223)","v":0},{"$f":"SUM(V219:V223)","v":0},{"$f":"SUM(W219:W223)","v":0}]
[null,"Nettoeinsparung diskontiert (Barwert)",{"$f":"C224","v":0},{"$f":"D224*(1+C$39)^-D$160","v":0},0,0,0,0,0,0,0,0,0,0,0,0,0,0,0,0,0,0,0,null,null,{"$f":"SUM(C225:W225)","v":0}]
[]
[null,{"$f":"B$51","v":"Anbieter 8"}]
[null,{"$f":"$B$165","v":"Einspargarantie Kosten"},null,{"$f":"IF($AC84>0,\nIF(D$161<$AC84,0,\nIF($AC84=D$161,(13-$AD84)/12,\nIF(($AC84+$C84)>D$161,1,\nIF(($AC84+$C84)=D$161,(($AD84-1)/12+(13-$AD84)/12*$C117),\nIF(($AC84+Nutzungsdauer)>D$161,$C117,\nIF(($AC84+Nutzungsdauer)=D$161,($AD84-1)/12*$C117,\n0)))))),0)\n*($J51*(1+$D$24)^D$160+$K51*(1+$E$24)^D$160+$L51*(1+$F$24)^D$160+$N51*(1+$G$24)^D$160+SUM($O51:$Q51))","v":0},0,0,0,0,0,0,0,0,0,0,0,0,0,0,0,0,0,0,0]
[null,{"$f":"$B$166","v":"Einsparung Instandhaltung"},null,{"$f":"IF($AC84>0,\nIF(D$161<$AC84,0,\nIF($AC84=D$161,(13-$AD84)/12,\nIF(($AC84+$C84)>D$161,1,\nIF(($AC84+$C84)=D$161,(($AD84-1)/12),\n0)))),0)\n*($D117*$L84)*(1+$I$24)^D$160","v":0},0,0,0,0,0,0,0,0,0,0,0,0,0,0,0,0,0,0,0]
[null,{"$f":"$B$167","v":"Vergütung Contractor (inkl. Baukostenzuschuss im Jahr 0)"},{"$f":"-$N$84","v":0},{"$f":"IF($AC84>0,\nIF(D$161<$AC84,0,\nIF($AC84=D$161,(13-$AD84)/12,\nIF(($AC84+$C84)>D$161,1,\nIF(($AC84+$C84)=D$161,(($AD84-1)/12),\n0)))),0)\n*-$H84","v":0},0,0,0,0,0,0,0,0,0,0,0,0,0,0,0,0,0,0,0]
[null,{"$f":"$B$168","v":"Ersatzinvestition inkl. deren Restwert am Ende des Betrachtungszeitraums"},null,{"$f":"IF(AND($AC$84>0,$I$117>0),\nIF($C$84<Nutzungsdauer,\nIF(D$161=$AC$84+$C$84,-$I$117*(1+r_invest)^D$160,\nIF(D$161=$AC$84+Nutzungsdauer,$F$84*(1+r_invest)^D$160*($J$117-(Nutzungsdauer-$C$84))/$J$117,0)),0),0)","v":0},0,0,0,0,0,0,0,0,0,0,0,0,0,0,{"$f":"IF(AND($AC$84>0,$I$117>0),\nIF($C$84<Nutzungsdauer,\nIF(S$161=$AC$84+$C$84,-$I$117*(1+r_invest)^S$160,\nIF(S$161=$AC$84+Nutzungsdauer,$I$117*(1+r_invest)^S$160*($J$117-(Nutzungsdauer-$C$84))/$J$117,0)),0),0)","v":0},0,0,0,0]
[null,"Einsparung CO2-Emissionen",null,{"$f":"IF($AC84>0,\nIF(D$161<$AC84,0,\nIF($AC84=D$161,(13-$AD84)/12,\nIF(($AC84+$C84)>D$161,1,\nIF(($AC84+$C84)=D$161,(($AD84-1)/12+(13-$AD84)/12*$C117),\nIF(($AC84+Nutzungsdauer)>D$161,$C117,\nIF(($AC84+Nutzungsdauer)=D$161,($AD84-1)/12*$C117,\n0)))))),0)\n*($M51*$C$24*(1+$J$24)^D$160)","v":0},0,0,0,0,0,0,0,0,0,0,0,0,0,0,0,0,0,0,0]
[null,{"$f":"$B$170","v":"Nettoersparnis"},{"$f":"SUM(C228:C232)","v":0},0,0,0,0,0,0,0,0,0,0,0,0,0,0,0,0,0,{"$f":"SUM(U228:U232)","v":0},{"$f":"SUM(V228:V232)","v":0},{"$f":"SUM(W228:W232)","v":0}]
[null,"Nettoeinsparung diskontiert (Barwert)",{"$f":"C233","v":0},{"$f":"D233*(1+C$39)^-D$160","v":0},0,0,0,0,0,0,0,0,0,0,0,0,0,0,0,0,0,0,0,null,null,{"$f":"SUM(C234:W234)","v":0}]
[]
[null,{"$f":"B$52","v":"Anbieter 9"}]
[null,{"$f":"$B$165","v":"Einspargarantie Kosten"},null,{"$f":"IF($AC85>0,\nIF(D$161<$AC85,0,\nIF($AC85=D$161,(13-$AD85)/12,\nIF(($AC85+$C85)>D$161,1,\nIF(($AC85+$C85)=D$161,(($AD85-1)/12+(13-$AD85)/12*$C118),\nIF(($AC85+Nutzungsdauer)>D$161,$C118,\nIF(($AC85+Nutzungsdauer)=D$161,($AD85-1)/12*$C118,\n0)))))),0)\n*($J52*(1+$D$24)^D$160+$K52*(1+$E$24)^D$160+$L52*(1+$F$24)^D$160+$N52*(1+$G$24)^D$160+SUM($O52:$Q52))","v":0},0,0,0,0,0,0,0,0,0,0,0,0,0,0,0,0,0,0,0]
[null,{"$f":"$B$166","v":"Einsparung Instandhaltung"},null,{"$f":"IF($AC85>0,\nIF(D$161<$AC85,0,\nIF($AC85=D$161,(13-$AD85)/12,\nIF(($AC85+$C85)>D$161,1,\nIF(($AC85+$C85)=D$161,(($AD85-1)/12),\n0)))),0)\n*($D118*$L85)*(1+$I$24)^D$160","v":0},0,0,0,0,0,0,0,0,0,0,0,0,0,0,0,0,0,0,0]
[null,{"$f":"$B$167","v":"Vergütung Contractor (inkl. Baukostenzuschuss im Jahr 0)"},{"$f":"-$N$85","v":0},{"$f":"IF($AC85>0,\nIF(D$161<$AC85,0,\nIF($AC85=D$161,(13-$AD85)/12,\nIF(($AC85+$C85)>D$161,1,\nIF(($AC85+$C85)=D$161,(($AD85-1)/12),\n0)))),0)\n*-$H85","v":0},0,0,0,0,0,0,0,0,0,0,0,0,0,0,0,0,0,0,0]
[null,{"$f":"$B$168","v":"Ersatzinvestition inkl. deren Restwert am Ende des Betrachtungszeitraums"},null,{"$f":"IF(AND($AC$85>0,$I$118>0),\nIF($C$85<Nutzungsdauer,\nIF(D$161=$AC$85+$C$85,-$I$118*(1+r_invest)^D$160,\nIF(D$161=$AC$85+Nutzungsdauer,$F$85*(1+r_invest)^D$160*($J$118-(Nutzungsdauer-$C$85))/$J$118,0)),0),0)","v":0},0,0,0,0,0,0,0,0,0,0,0,0,0,0,{"$f":"IF(AND($AC$85>0,$I$118>0),\nIF($C$85<Nutzungsdauer,\nIF(S$161=$AC$85+$C$85,-$I$118*(1+r_invest)^S$160,\nIF(S$161=$AC$85+Nutzungsdauer,$I$118*(1+r_invest)^S$160*($J$118-(Nutzungsdauer-$C$85))/$J$118,0)),0),0)","v":0},0,0,0,0]
[null,"Einsparung CO2-Emissionen",null,{"$f":"IF($AC85>0,\nIF(D$161<$AC85,0,\nIF($AC85=D$161,(13-$AD85)/12,\nIF(($AC85+$C85)>D$161,1,\nIF(($AC85+$C85)=D$161,(($AD85-1)/12+(13-$AD85)/12*$C118),\nIF(($AC85+Nutzungsdauer)>D$161,$C118,\nIF(($AC85+Nutzungsdauer)=D$161,($AD85-1)/12*$C118,\n0)))))),0)\n*($M52*$C$24*(1+$J$24)^D$160)","v":0},0,0,0,0,0,0,0,0,0,0,0,0,0,0,0,0,0,0,0]
[null,{"$f":"$B$170","v":"Nettoersparnis"},{"$f":"SUM(C237:C241)","v":0},0,0,0,0,0,0,0,0,0,0,0,0,0,0,0,0,0,{"$f":"SUM(U237:U241)","v":0},{"$f":"SUM(V237:V241)","v":0},{"$f":"SUM(W237:W241)","v":0}]
[null,"Nettoeinsparung diskontiert (Barwert)",{"$f":"C242","v":0},{"$f":"D242*(1+C$39)^-D$160","v":0},0,0,0,0,0,0,0,0,0,0,0,0,0,0,0,0,0,0,0,null,null,{"$f":"SUM(C243:W243)","v":0}]
[]
[null,{"$f":"B$53","v":"Anbieter 10"}]
[null,{"$f":"$B$165","v":"Einspargarantie Kosten"},null,{"$f":"IF($AC86>0,\nIF(D$161<$AC86,0,\nIF($AC86=D$161,(13-$AD86)/12,\nIF(($AC86+$C86)>D$161,1,\nIF(($AC86+$C86)=D$161,(($AD86-1)/12+(13-$AD86)/12*$C119),\nIF(($AC86+Nutzungsdauer)>D$161,$C119,\nIF(($AC86+Nutzungsdauer)=D$161,($AD86-1)/12*$C119,\n0)))))),0)\n*($J53*(1+$D$24)^D$160+$K53*(1+$E$24)^D$160+$L53*(1+$F$24)^D$160+$N53*(1+$G$24)^D$160+SUM($O53:$Q53))","v":0},0,0,0,0,0,0,0,0,0,0,0,0,0,0,0,0,0,0,0]
[null,{"$f":"$B$166","v":"Einsparung Instandhaltung"},null,{"$f":"IF($AC86>0,\nIF(D$161<$AC86,0,\nIF($AC86=D$161,(13-$AD86)/12,\nIF(($AC86+$C86)>D$161,1,\nIF(($AC86+$C86)=D$161,(($AD86-1)/12),\n0)))),0)\n*($D119*$L86)*(1+$I$24)^D$160","v":0},0,0,0,0,0,0,0,0,0,0,0,0,0,0,0,0,0,0,0]
[null,{"$f":"$B$167","v":"Vergütung Contractor (inkl. Baukostenzuschuss im Jahr 0)"},{"$f":"-$N$86","v":0},{"$f":"IF($AC86>0,\nIF(D$161<$AC86,0,\nIF($AC86=D$161,(13-$AD86)/12,\nIF(($AC86+$C86)>D$161,1,\nIF(($AC86+$C86)=D$161,(($AD86-1)/12),\n0)))),0)\n*-$H86","v":0},0,0,0,0,0,0,0,0,0,0,0,0,0,0,0,0,0,0,0]
[null,{"$f":"$B$168","v":"Ersatzinvestition inkl. deren Restwert am Ende des Betrachtungszeitraums"},null,{"$f":"IF(AND($AC$86>0,$I$119>0),\nIF($C$86<Nutzungsdauer,\nIF(D$161=$AC$86+$C$86,-$I$119*(1+r_invest)^D$160,\nIF(D$161=$AC$86+Nutzungsdauer,$F$86*(1+r_invest)^D$160*($J$119-(Nutzungsdauer-$C$86))/$J$119,0)),0),0)","v":0},0,0,0,0,0,0,0,0,0,0,0,0,0,0,{"$f":"IF(AND($AC$86>0,$I$119>0),\nIF($C$86<Nutzungsdauer,\nIF(S$161=$AC$86+$C$86,-$I$119*(1+r_invest)^S$160,\nIF(S$161=$AC$86+Nutzungsdauer,$I$119*(1+r_invest)^S$160*($J$119-(Nutzungsdauer-$C$86))/$J$119,0)),0),0)","v":0},0,0,0,0]
[null,"Einsparung CO2-Emissionen",null,{"$f":"IF($AC86>0,\nIF(D$161<$AC86,0,\nIF($AC86=D$161,(13-$AD86)/12,\nIF(($AC86+$C86)>D$161,1,\nIF(($AC86+$C86)=D$161,(($AD86-1)/12+(13-$AD86)/12*$C119),\nIF(($AC86+Nutzungsdauer)>D$161,$C119,\nIF(($AC86+Nutzungsdauer)=D$161,($AD86-1)/12*$C119,\n0)))))),0)\n*($M53*$C$24*(1+$J$24)^D$160)","v":0},0,0,0,0,0,0,0,0,0,0,0,0,0,0,0,0,0,0,0]
[null,{"$f":"$B$170","v":"Nettoersparnis"},{"$f":"SUM(C246:C250)","v":0},0,0,0,0,0,0,0,0,0,0,0,0,0,0,0,0,0,{"$f":"SUM(U246:U250)","v":0},{"$f":"SUM(V246:V250)","v":0},{"$f":"SUM(W246:W250)","v":0}]
[null,"Nettoeinsparung diskontiert (Barwert)",{"$f":"C251","v":0},{"$f":"D251*(1+C$39)^-D$160","v":0},0,0,0,0,0,0,0,0,0,0,0,0,0,0,0,0,0,0,0,null,null,{"$f":"SUM(C252:W252)","v":0}]
[]
[null,{"$f":"B$54","v":"Anbieter 11"}]
[null,{"$f":"$B$165","v":"Einspargarantie Kosten"},null,{"$f":"IF($AC87>0,\nIF(D$161<$AC87,0,\nIF($AC87=D$161,(13-$AD87)/12,\nIF(($AC87+$C87)>D$161,1,\nIF(($AC87+$C87)=D$161,(($AD87-1)/12+(13-$AD87)/12*$C120),\nIF(($AC87+Nutzungsdauer)>D$161,$C120,\nIF(($AC87+Nutzungsdauer)=D$161,($AD87-1)/12*$C120,\n0)))))),0)\n*($J54*(1+$D$24)^D$160+$K54*(1+$E$24)^D$160+$L54*(1+$F$24)^D$160+$N54*(1+$G$24)^D$160+SUM($O54:$Q54))","v":0},0,0,0,0,0,0,0,0,0,0,0,0,0,0,0,0,0,0,0]
[null,{"$f":"$B$166","v":"Einsparung Instandhaltung"},null,{"$f":"IF($AC87>0,\nIF(D$161<$AC87,0,\nIF($AC87=D$161,(13-$AD87)/12,\nIF(($AC87+$C87)>D$161,1,\nIF(($AC87+$C87)=D$161,(($AD87-1)/12),\n0)))),0)\n*($D120*$L87)*(1+$I$24)^D$160","v":0},0,0,0,0,0,0,0,0,0,0,0,0,0,0,0,0,0,0,0]
[null,{"$f":"$B$167","v":"Vergütung Contractor (inkl. Baukostenzuschuss im Jahr 0)"},{"$f":"-$N$87","v":0},{"$f":"IF($AC87>0,\nIF(D$161<$AC87,0,\nIF($AC87=D$161,(13-$AD87)/12,\nIF(($AC87+$C87)>D$161,1,\nIF(($AC87+$C87)=D$161,(($AD87-1)/12),\n0)))),0)\n*-$H87","v":0},0,0,0,0,0,0,0,0,0,0,0,0,0,0,0,0,0,0,0]
[null,{"$f":"$B$168","v":"Ersatzinvestition inkl. deren Restwert am Ende des Betrachtungszeitraums"},null,{"$f":"IF(AND($AC$87>0,$I$120>0),\nIF($C$87<Nutzungsdauer,\nIF(D$161=$AC$87+$C$87,-$I$120*(1+r_invest)^D$160,\nIF(D$161=$AC$87+Nutzungsdauer,$F$87*(1+r_invest)^D$160*($J$120-(Nutzungsdauer-$C$87))/$J$120,0)),0),0)","v":0},0,0,0,0,0,0,0,0,0,0,0,0,0,0,{"$f":"IF(AND($AC$87>0,$I$120>0),\nIF($C$87<Nutzungsdauer,\nIF(S$161=$AC$87+$C$87,-$I$120*(1+r_invest)^S$160,\nIF(S$161=$AC$87+Nutzungsdauer,$I$120*(1+r_invest)^S$160*($J$120-(Nutzungsdauer-$C$87))/$J$120,0)),0),0)","v":0},0,0,0,0]
[null,"Einsparung CO2-Emissionen",null,{"$f":"IF($AC87>0,\nIF(D$161<$AC87,0,\nIF($AC87=D$161,(13-$AD87)/12,\nIF(($AC87+$C87)>D$161,1,\nIF(($AC87+$C87)=D$161,(($AD87-1)/12+(13-$AD87)/12*$C120),\nIF(($AC87+Nutzungsdauer)>D$161,$C120,\nIF(($AC87+Nutzungsdauer)=D$161,($AD87-1)/12*$C120,\n0)))))),0)\n*($M54*$C$24*(1+$J$24)^D$160)","v":0},0,0,0,0,0,0,0,0,0,0,0,0,0,0,0,0,0,0,0]
[null,{"$f":"$B$170","v":"Nettoersparnis"},{"$f":"SUM(C255:C259)","v":0},0,0,0,0,0,0,0,0,0,0,0,0,0,0,0,0,0,{"$f":"SUM(U255:U259)","v":0},{"$f":"SUM(V255:V259)","v":0},{"$f":"SUM(W255:W259)","v":0}]
[null,"Nettoeinsparung diskontiert (Barwert)",{"$f":"C260","v":0},{"$f":"D260*(1+C$39)^-D$160","v":0},0,0,0,0,0,0,0,0,0,0,0,0,0,0,0,0,0,0,0,null,null,{"$f":"SUM(C261:W261)","v":0}]
[]
[null,{"$f":"B$55","v":"Anbieter 12"}]
[null,{"$f":"$B$165","v":"Einspargarantie Kosten"},null,{"$f":"IF($AC88>0,\nIF(D$161<$AC88,0,\nIF($AC88=D$161,(13-$AD88)/12,\nIF(($AC88+$C88)>D$161,1,\nIF(($AC88+$C88)=D$161,(($AD88-1)/12+(13-$AD88)/12*$C121),\nIF(($AC88+Nutzungsdauer)>D$161,$C121,\nIF(($AC88+Nutzungsdauer)=D$161,($AD88-1)/12*$C121,\n0)))))),0)\n*($J55*(1+$D$24)^D$160+$K55*(1+$E$24)^D$160+$L55*(1+$F$24)^D$160+$N55*(1+$G$24)^D$160+SUM($O55:$Q55))","v":0},0,0,0,0,0,0,0,0,0,0,0,0,0,0,0,0,0,0,0]
[null,{"$f":"$B$166","v":"Einsparung Instandhaltung"},null,{"$f":"IF($AC88>0,\nIF(D$161<$AC88,0,\nIF($AC88=D$161,(13-$AD88)/12,\nIF(($AC88+$C88)>D$161,1,\nIF(($AC88+$C88)=D$161,(($AD88-1)/12),\n0)))),0)\n*($D121*$L88)*(1+$I$24)^D$160","v":0},0,0,0,0,0,0,0,0,0,0,0,0,0,0,0,0,0,0,0]
[null,{"$f":"$B$167","v":"Vergütung Contractor (inkl. Baukostenzuschuss im Jahr 0)"},{"$f":"-$N$88","v":0},{"$f":"IF($AC88>0,\nIF(D$161<$AC88,0,\nIF($AC88=D$161,(13-$AD88)/12,\nIF(($AC88+$C88)>D$161,1,\nIF(($AC88+$C88)=D$161,(($AD88-1)/12),\n0)))),0)\n*-$H88","v":0},0,0,0,0,0,0,0,0,0,0,0,0,0,0,0,0,0,0,0]
[null,{"$f":"$B$168","v":"Ersatzinvestition inkl. deren Restwert am Ende des Betrachtungszeitraums"},null,{"$f":"IF(AND($AC$88>0,$I$121>0),\nIF($C$88<Nutzungsdauer,\nIF(D$161=$AC$88+$C$88,-$I$121*(1+r_invest)^D$160,\nIF(D$161=$AC$88+Nutzungsdauer,$F$88*(1+r_invest)^D$160*($J$121-(Nutzungsdauer-$C$88))/$J$121,0)),0),0)","v":0},0,0,0,0,0,0,0,0,0,0,0,0,0,0,{"$f":"IF(AND($AC$88>0,$I$121>0),\nIF($C$88<Nutzungsdauer,\nIF(S$161=$AC$88+$C$88,-$I$121*(1+r_invest)^S$160,\nIF(S$161=$AC$88+Nutzungsdauer,$I$121*(1+r_invest)^S$160*($J$121-(Nutzungsdauer-$C$88))/$J$121,0)),0),0)","v":0},0,0,0,0]
[null,"Einsparung CO2-Emissionen",null,{"$f":"IF($AC88>0,\nIF(D$161<$AC88,0,\nIF($AC88=D$161,(13-$AD88)/12,\nIF(($AC88+$C88)>D$161,1,\nIF(($AC88+$C88)=D$161,(($AD88-1)/12+(13-$AD88)/12*$C121),\nIF(($AC88+Nutzungsdauer)>D$161,$C121,\nIF(($AC88+Nutzungsdauer)=D$161,($AD88-1)/12*$C121,\n0)))))),0)\n*($M55*$C$24*(1+$J$24)^D$160)","v":0},0,0,0,0,0,0,0,0,0,0,0,0,0,0,0,0,0,0,0]
[null,{"$f":"$B$170","v":"Nettoersparnis"},{"$f":"SUM(C264:C268)","v":0},0,0,0,0,0,0,0,0,0,0,0,0,0,0,0,0,0,{"$f":"SUM(U264:U268)","v":0},{"$f":"SUM(V264:V268)","v":0},{"$f":"SUM(W264:W268)","v":0}]
[null,"Nettoeinsparung diskontiert (Barwert)",{"$f":"C269","v":0},{"$f":"D269*(1+C$39)^-D$160","v":0},0,0,0,0,0,0,0,0,0,0,0,0,0,0,0,0,0,0,0,null,null,{"$f":"SUM(C270:W270)","v":0}]
[]
[null,{"$f":"B$56","v":"Anbieter 13"}]
[null,{"$f":"$B$165","v":"Einspargarantie Kosten"},null,{"$f":"IF($AC89>0,\nIF(D$161<$AC89,0,\nIF($AC89=D$161,(13-$AD89)/12,\nIF(($AC89+$C89)>D$161,1,\nIF(($AC89+$C89)=D$161,(($AD89-1)/12+(13-$AD89)/12*$C122),\nIF(($AC89+Nutzungsdauer)>D$161,$C122,\nIF(($AC89+Nutzungsdauer)=D$161,($AD89-1)/12*$C122,\n0)))))),0)\n*($J56*(1+$D$24)^D$160+$K56*(1+$E$24)^D$160+$L56*(1+$F$24)^D$160+$N56*(1+$G$24)^D$160+SUM($O56:$Q56))","v":0},0,0,0,0,0,0,0,0,0,0,0,0,0,0,0,0,0,0,0]
[null,{"$f":"$B$166","v":"Einsparung Instandhaltung"},null,{"$f":"IF($AC89>0,\nIF(D$161<$AC89,0,\nIF($AC89=D$161,(13-$AD89)/12,\nIF(($AC89+$C89)>D$161,1,\nIF(($AC89+$C89)=D$161,(($AD89-1)/12),\n0)))),0)\n*($D122*$L89)*(1+$I$24)^D$160","v":0},0,0,0,0,0,0,0,0,0,0,0,0,0,0,0,0,0,0,0]
[null,{"$f":"$B$167","v":"Vergütung Contractor (inkl. Baukostenzuschuss im Jahr 0)"},{"$f":"-$N$89","v":0},{"$f":"IF($AC89>0,\nIF(D$161<$AC89,0,\nIF($AC89=D$161,(13-$AD89)/12,\nIF(($AC89+$C89)>D$161,1,\nIF(($AC89+$C89)=D$161,(($AD89-1)/12),\n0)))),0)\n*-$H89","v":0},0,0,0,0,0,0,0,0,0,0,0,0,0,0,0,0,0,0,0]
[null,{"$f":"$B$168","v":"Ersatzinvestition inkl. deren Restwert am Ende des Betrachtungszeitraums"},null,{"$f":"IF(AND($AC$89>0,$I$122>0),\nIF($C$89<Nutzungsdauer,\nIF(D$161=$AC$89+$C$89,-$I$122*(1+r_invest)^D$160,\nIF(D$161=$AC$89+Nutzungsdauer,$F$89*(1+r_invest)^D$160*($J$122-(Nutzungsdauer-$C$89))/$J$122,0)),0),0)","v":0},0,0,0,0,0,0,0,0,0,0,0,0,0,0,{"$f":"IF(AND($AC$89>0,$I$122>0),\nIF($C$89<Nutzungsdauer,\nIF(S$161=$AC$89+$C$89,-$I$122*(1+r_invest)^S$160,\nIF(S$161=$AC$89+Nutzungsdauer,$I$122*(1+r_invest)^S$160*($J$122-(Nutzungsdauer-$C$89))/$J$122,0)),0),0)","v":0},0,0,0,0]
[null,"Einsparung CO2-Emissionen",null,{"$f":"IF($AC89>0,\nIF(D$161<$AC89,0,\nIF($AC89=D$161,(13-$AD89)/12,\nIF(($AC89+$C89)>D$161,1,\nIF(($AC89+$C89)=D$161,(($AD89-1)/12+(13-$AD89)/12*$C122),\nIF(($AC89+Nutzungsdauer)>D$161,$C122,\nIF(($AC89+Nutzungsdauer)=D$161,($AD89-1)/12*$C122,\n0)))))),0)\n*($M56*$C$24*(1+$J$24)^D$160)","v":0},0,0,0,0,0,0,0,0,0,0,0,0,0,0,0,0,0,0,0]
[null,{"$f":"$B$170","v":"Nettoersparnis"},{"$f":"SUM(C273:C277)","v":0},0,0,0,0,0,0,0,0,0,0,0,0,0,0,0,0,0,{"$f":"SUM(U273:U277)","v":0},{"$f":"SUM(V273:V277)","v":0},{"$f":"SUM(W273:W277)","v":0}]
[null,"Nettoeinsparung diskontiert (Barwert)",{"$f":"C278","v":0},{"$f":"D278*(1+C$39)^-D$160","v":0},0,0,0,0,0,0,0,0,0,0,0,0,0,0,0,0,0,0,0,null,null,{"$f":"SUM(C279:W279)","v":0}]
[]
[null,{"$f":"B$57","v":"Anbieter 14"}]
[null,{"$f":"$B$165","v":"Einspargarantie Kosten"},null,{"$f":"IF($AC90>0,\nIF(D$161<$AC90,0,\nIF($AC90=D$161,(13-$AD90)/12,\nIF(($AC90+$C90)>D$161,1,\nIF(($AC90+$C90)=D$161,(($AD90-1)/12+(13-$AD90)/12*$C123),\nIF(($AC90+Nutzungsdauer)>D$161,$C123,\nIF(($AC90+Nutzungsdauer)=D$161,($AD90-1)/12*$C123,\n0)))))),0)\n*($J57*(1+$D$24)^D$160+$K57*(1+$E$24)^D$160+$L57*(1+$F$24)^D$160+$N57*(1+$G$24)^D$160+SUM($O57:$Q57))","v":0},0,0,0,0,0,0,0,0,0,0,0,0,0,0,0,0,0,0,0]
[null,{"$f":"$B$166","v":"Einsparung Instandhaltung"},null,{"$f":"IF($AC90>0,\nIF(D$161<$AC90,0,\nIF($AC90=D$161,(13-$AD90)/12,\nIF(($AC90+$C90)>D$161,1,\nIF(($AC90+$C90)=D$161,(($AD90-1)/12),\n0)))),0)\n*($D123*$L90)*(1+$I$24)^D$160","v":0},0,0,0,0,0,0,0,0,0,0,0,0,0,0,0,0,0,0,0]
[null,{"$f":"$B$167","v":"Vergütung Contractor (inkl. Baukostenzuschuss im Jahr 0)"},{"$f":"-$N$90","v":0},{"$f":"IF($AC90>0,\nIF(D$161<$AC90,0,\nIF($AC90=D$161,(13-$AD90)/12,\nIF(($AC90+$C90)>D$161,1,\nIF(($AC90+$C90)=D$161,(($AD90-1)/12),\n0)))),0)\n*-$H90","v":0},0,0,0,0,0,0,0,0,0,0,0,0,0,0,0,0,0,0,0]
[null,{"$f":"$B$168","v":"Ersatzinvestition inkl. deren Restwert am Ende des Betrachtungszeitraums"},null,{"$f":"IF(AND($AC$90>0,$I$123>0),\nIF($C$90<Nutzungsdauer,\nIF(D$161=$AC$90+$C$90,-$I$123*(1+r_invest)^D$160,\nIF(D$161=$AC$90+Nutzungsdauer,$F$90*(1+r_invest)^D$160*($J$123-(Nutzungsdauer-$C$90))/$J$123,0)),0),0)","v":0},0,0,0,0,0,0,0,0,0,0,0,0,0,0,{"$f":"IF(AND($AC$90>0,$I$123>0),\nIF($C$90<Nutzungsdauer,\nIF(S$161=$AC$90+$C$90,-$I$123*(1+r_invest)^S$160,\nIF(S$161=$AC$90+Nutzungsdauer,$I$123*(1+r_invest)^S$160*($J$123-(Nutzungsdauer-$C$90))/$J$123,0)),0),0)","v":0},0,0,0,0]
[null,"Einsparung CO2-Emissionen",null,{"$f":"IF($AC90>0,\nIF(D$161<$AC90,0,\nIF($AC90=D$161,(13-$AD90)/12,\nIF(($AC90+$C90)>D$161,1,\nIF(($AC90+$C90)=D$161,(($AD90-1)/12+(13-$AD90)/12*$C123),\nIF(($AC90+Nutzungsdauer)>D$161,$C123,\nIF(($AC90+Nutzungsdauer)=D$161,($AD90-1)/12*$C123,\n0)))))),0)\n*($M57*$C$24*(1+$J$24)^D$160)","v":0},0,0,0,0,0,0,0,0,0,0,0,0,0,0,0,0,0,0,0]
[null,{"$f":"$B$170","v":"Nettoersparnis"},{"$f":"SUM(C282:C286)","v":0},0,0,0,0,0,0,0,0,0,0,0,0,0,0,0,0,0,{"$f":"SUM(U282:U286)","v":0},{"$f":"SUM(V282:V286)","v":0},{"$f":"SUM(W282:W286)","v":0}]
[null,"Nettoeinsparung diskontiert (Barwert)",{"$f":"C287","v":0},{"$f":"D287*(1+C$39)^-D$160","v":0},0,0,0,0,0,0,0,0,0,0,0,0,0,0,0,0,0,0,0,null,null,{"$f":"SUM(C288:W288)","v":0}]
[]
[null,{"$f":"B$58","v":"Anbieter 15"}]
[null,{"$f":"$B$165","v":"Einspargarantie Kosten"},null,{"$f":"IF($AC91>0,\nIF(D$161<$AC91,0,\nIF($AC91=D$161,(13-$AD91)/12,\nIF(($AC91+$C91)>D$161,1,\nIF(($AC91+$C91)=D$161,(($AD91-1)/12+(13-$AD91)/12*$C124),\nIF(($AC91+Nutzungsdauer)>D$161,$C124,\nIF(($AC91+Nutzungsdauer)=D$161,($AD91-1)/12*$C124,\n0)))))),0)\n*($J58*(1+$D$24)^D$160+$K58*(1+$E$24)^D$160+$L58*(1+$F$24)^D$160+$N58*(1+$G$24)^D$160+SUM($O58:$Q58))","v":0},0,0,0,0,0,0,0,0,0,0,0,0,0,0,0,0,0,0,0]
[null,{"$f":"$B$166","v":"Einsparung Instandhaltung"},null,{"$f":"IF($AC91>0,\nIF(D$161<$AC91,0,\nIF($AC91=D$161,(13-$AD91)/12,\nIF(($AC91+$C91)>D$161,1,\nIF(($AC91+$C91)=D$161,(($AD91-1)/12),\n0)))),0)\n*($D124*$L91)*(1+$I$24)^D$160","v":0},0,0,0,0,0,0,0,0,0,0,0,0,0,0,0,0,0,0,0]
[null,{"$f":"$B$167","v":"Vergütung Contractor (inkl. Baukostenzuschuss im Jahr 0)"},{"$f":"-$N$91","v":0},{"$f":"IF($AC91>0,\nIF(D$161<$AC91,0,\nIF($AC91=D$161,(13-$AD91)/12,\nIF(($AC91+$C91)>D$161,1,\nIF(($AC91+$C91)=D$161,(($AD91-1)/12),\n0)))),0)\n*-$H91","v":0},0,0,0,0,0,0,0,0,0,0,0,0,0,0,0,0,0,0,0]
[null,{"$f":"$B$168","v":"Ersatzinvestition inkl. deren Restwert am Ende des Betrachtungszeitraums"},null,{"$f":"IF(AND($AC$91>0,$I$124>0),\nIF($C$91<Nutzungsdauer,\nIF(D$161=$AC$91+$C$91,-$I$124*(1+r_invest)^D$160,\nIF(D$161=$AC$91+Nutzungsdauer,$F$91*(1+r_invest)^D$160*($J$124-(Nutzungsdauer-$C$91))/$J$124,0)),0),0)","v":0},0,0,0,0,0,0,0,0,0,0,0,0,0,0,{"$f":"IF(AND($AC$91>0,$I$124>0),\nIF($C$91<Nutzungsdauer,\nIF(S$161=$AC$91+$C$91,-$I$124*(1+r_invest)^S$160,\nIF(S$161=$AC$91+Nutzungsdauer,$I$124*(1+r_invest)^S$160*($J$124-(Nutzungsdauer-$C$91))/$J$124,0)),0),0)","v":0},0,0,0,0]
[null,"Einsparung CO2-Emissionen",null,{"$f":"IF($AC91>0,\nIF(D$161<$AC91,0,\nIF($AC91=D$161,(13-$AD91)/12,\nIF(($AC91+$C91)>D$161,1,\nIF(($AC91+$C91)=D$161,(($AD91-1)/12+(13-$AD91)/12*$C124),\nIF(($AC91+Nutzungsdauer)>D$161,$C124,\nIF(($AC91+Nutzungsdauer)=D$161,($AD91-1)/12*$C124,\n0)))))),0)\n*($M58*$C$24*(1+$J$24)^D$160)","v":0},0,0,0,0,0,0,0,0,0,0,0,0,0,0,0,0,0,0,0]
[null,{"$f":"$B$170","v":"Nettoersparnis"},{"$f":"SUM(C291:C295)","v":0},0,0,0,0,0,0,0,0,0,0,0,0,0,0,0,0,0,{"$f":"SUM(U291:U295)","v":0},{"$f":"SUM(V291:V295)","v":0},{"$f":"SUM(W291:W295)","v":0}]
[null,"Nettoeinsparung diskontiert (Barwert)",{"$f":"C296","v":0},{"$f":"D296*(1+C$39)^-D$160","v":0},0,0,0,0,0,0,0,0,0,0,0,0,0,0,0,0,0,0,0,null,null,{"$f":"SUM(C297:W297)","v":0}]
[]
[null,{"$f":"B$59","v":"Anbieter 16"}]
[null,{"$f":"$B$165","v":"Einspargarantie Kosten"},null,{"$f":"IF($AC92>0,\nIF(D$161<$AC92,0,\nIF($AC92=D$161,(13-$AD92)/12,\nIF(($AC92+$C92)>D$161,1,\nIF(($AC92+$C92)=D$161,(($AD92-1)/12+(13-$AD92)/12*$C125),\nIF(($AC92+Nutzungsdauer)>D$161,$C125,\nIF(($AC92+Nutzungsdauer)=D$161,($AD92-1)/12*$C125,\n0)))))),0)\n*($J59*(1+$D$24)^D$160+$K59*(1+$E$24)^D$160+$L59*(1+$F$24)^D$160+$N59*(1+$G$24)^D$160+SUM($O59:$Q59))","v":0},0,0,0,0,0,0,0,0,0,0,0,0,0,0,0,0,0,0,0]
[null,{"$f":"$B$166","v":"Einsparung Instandhaltung"},null,{"$f":"IF($AC92>0,\nIF(D$161<$AC92,0,\nIF($AC92=D$161,(13-$AD92)/12,\nIF(($AC92+$C92)>D$161,1,\nIF(($AC92+$C92)=D$161,(($AD92-1)/12),\n0)))),0)\n*($D125*$L92)*(1+$I$24)^D$160","v":0},0,0,0,0,0,0,0,0,0,0,0,0,0,0,0,0,0,0,0]
[null,{"$f":"$B$167","v":"Vergütung Contractor (inkl. Baukostenzuschuss im Jahr 0)"},{"$f":"-$N$92","v":0},{"$f":"IF($AC92>0,\nIF(D$161<$AC92,0,\nIF($AC92=D$161,(13-$AD92)/12,\nIF(($AC92+$C92)>D$161,1,\nIF(($AC92+$C92)=D$161,(($AD92-1)/12),\n0)))),0)\n*-$H92","v":0},0,0,0,0,0,0,0,0,0,0,0,0,0,0,0,0,0,0,0]
[null,{"$f":"$B$168","v":"Ersatzinvestition inkl. deren Restwert am Ende des Betrachtungszeitraums"},null,{"$f":"IF(AND($AC$92>0,$I$125>0),\nIF($C$92<Nutzungsdauer,\nIF(D$161=$AC$92+$C$92,-$I$125*(1+r_invest)^D$160,\nIF(D$161=$AC$92+Nutzungsdauer,$F$92*(1+r_invest)^D$160*($J$125-(Nutzungsdauer-$C$92))/$J$125,0)),0),0)","v":0},0,0,0,0,0,0,0,0,0,0,0,0,0,0,{"$f":"IF(AND($AC$92>0,$I$125>0),\nIF($C$92<Nutzungsdauer,\nIF(S$161=$AC$92+$C$92,-$I$125*(1+r_invest)^S$160,\nIF(S$161=$AC$92+Nutzungsdauer,$I$125*(1+r_invest)^S$160*($J$125-(Nutzungsdauer-$C$92))/$J$125,0)),0),0)","v":0},0,0,0,0]
[null,"Einsparung CO2-Emissionen",null,{"$f":"IF($AC92>0,\nIF(D$161<$AC92,0,\nIF($AC92=D$161,(13-$AD92)/12,\nIF(($AC92+$C92)>D$161,1,\nIF(($AC92+$C92)=D$161,(($AD92-1)/12+(13-$AD92)/12*$C125),\nIF(($AC92+Nutzungsdauer)>D$161,$C125,\nIF(($AC92+Nutzungsdauer)=D$161,($AD92-1)/12*$C125,\n0)))))),0)\n*($M59*$C$24*(1+$J$24)^D$160)","v":0},0,0,0,0,0,0,0,0,0,0,0,0,0,0,0,0,0,0,0]
[null,{"$f":"$B$170","v":"Nettoersparnis"},{"$f":"SUM(C300:C304)","v":0},0,0,0,0,0,0,0,0,0,0,0,0,0,0,0,0,0,{"$f":"SUM(U300:U304)","v":0},{"$f":"SUM(V300:V304)","v":0},{"$f":"SUM(W300:W304)","v":0}]
[null,"Nettoeinsparung diskontiert (Barwert)",{"$f":"C305","v":0},{"$f":"D305*(1+C$39)^-D$160","v":0},0,0,0,0,0,0,0,0,0,0,0,0,0,0,0,0,0,0,0,null,null,{"$f":"SUM(C306:W306)","v":0}]
[]
[null,{"$f":"B$60","v":"Anbieter 17"}]
[null,{"$f":"$B$165","v":"Einspargarantie Kosten"},null,{"$f":"IF($AC93>0,\nIF(D$161<$AC93,0,\nIF($AC93=D$161,(13-$AD93)/12,\nIF(($AC93+$C93)>D$161,1,\nIF(($AC93+$C93)=D$161,(($AD93-1)/12+(13-$AD93)/12*$C126),\nIF(($AC93+Nutzungsdauer)>D$161,$C126,\nIF(($AC93+Nutzungsdauer)=D$161,($AD93-1)/12*$C126,\n0)))))),0)\n*($J60*(1+$D$24)^D$160+$K60*(1+$E$24)^D$160+$L60*(1+$F$24)^D$160+$N60*(1+$G$24)^D$160+SUM($O60:$Q60))","v":0},0,0,0,0,0,0,0,0,0,0,0,0,0,0,0,0,0,0,0]
[null,{"$f":"$B$166","v":"Einsparung Instandhaltung"},null,{"$f":"IF($AC93>0,\nIF(D$161<$AC93,0,\nIF($AC93=D$161,(13-$AD93)/12,\nIF(($AC93+$C93)>D$161,1,\nIF(($AC93+$C93)=D$161,(($AD93-1)/12),\n0)))),0)\n*($D126*$L93)*(1+$I$24)^D$160","v":0},0,0,0,0,0,0,0,0,0,0,0,0,0,0,0,0,0,0,0]
[null,{"$f":"$B$167","v":"Vergütung Contractor (inkl. Baukostenzuschuss im Jahr 0)"},{"$f":"-$N$93","v":0},{"$f":"IF($AC93>0,\nIF(D$161<$AC93,0,\nIF($AC93=D$161,(13-$AD93)/12,\nIF(($AC93+$C93)>D$161,1,\nIF(($AC93+$C93)=D$161,(($AD93-1)/12),\n0)))),0)\n*-$H93","v":0},0,0,0,0,0,0,0,0,0,0,0,0,0,0,0,0,0,0,0]
[null,{"$f":"$B$168","v":"Ersatzinvestition inkl. deren Restwert am Ende des Betrachtungszeitraums"},null,{"$f":"IF(AND($AC$93>0,$I$126>0),\nIF($C$93<Nutzungsdauer,\nIF(D$161=$AC$93+$C$93,-$I$126*(1+r_invest)^D$160,\nIF(D$161=$AC$93+Nutzungsdauer,$F$93*(1+r_invest)^D$160*($J$126-(Nutzungsdauer-$C$93))/$J$126,0)),0),0)","v":0},0,0,0,0,0,0,0,0,0,0,0,0,0,0,{"$f":"IF(AND($AC$93>0,$I$126>0),\nIF($C$93<Nutzungsdauer,\nIF(S$161=$AC$93+$C$93,-$I$126*(1+r_invest)^S$160,\nIF(S$161=$AC$93+Nutzungsdauer,$I$126*(1+r_invest)^S$160*($J$126-(Nutzungsdauer-$C$93))/$J$126,0)),0),0)","v":0},0,0,0,0]
[null,"Einsparung CO2-Emissionen",null,{"$f":"IF($AC93>0,\nIF(D$161<$AC93,0,\nIF($AC93=D$161,(13-$AD93)/12,\nIF(($AC93+$C93)>D$161,1,\nIF(($AC93+$C93)=D$161,(($AD93-1)/12+(13-$AD93)/12*$C126),\nIF(($AC93+Nutzungsdauer)>D$161,$C126,\nIF(($AC93+Nutzungsdauer)=D$161,($AD93-1)/12*$C126,\n0)))))),0)\n*($M60*$C$24*(1+$J$24)^D$160)","v":0},0,0,0,0,0,0,0,0,0,0,0,0,0,0,0,0,0,0,0]
[null,{"$f":"$B$170","v":"Nettoersparnis"},{"$f":"SUM(C309:C313)","v":0},0,0,0,0,0,0,0,0,0,0,0,0,0,0,0,0,0,{"$f":"SUM(U309:U313)","v":0},{"$f":"SUM(V309:V313)","v":0},{"$f":"SUM(W309:W313)","v":0}]
[null,"Nettoeinsparung diskontiert (Barwert)",{"$f":"C314","v":0},{"$f":"D314*(1+C$39)^-D$160","v":0},0,0,0,0,0,0,0,0,0,0,0,0,0,0,0,0,0,0,0,null,null,{"$f":"SUM(C315:W315)","v":0}]
[]
[null,{"$f":"B$61","v":"Anbieter 18"}]
[null,{"$f":"$B$165","v":"Einspargarantie Kosten"},null,{"$f":"IF($AC94>0,\nIF(D$161<$AC94,0,\nIF($AC94=D$161,(13-$AD94)/12,\nIF(($AC94+$C94)>D$161,1,\nIF(($AC94+$C94)=D$161,(($AD94-1)/12+(13-$AD94)/12*$C127),\nIF(($AC94+Nutzungsdauer)>D$161,$C127,\nIF(($AC94+Nutzungsdauer)=D$161,($AD94-1)/12*$C127,\n0)))))),0)\n*($J61*(1+$D$24)^D$160+$K61*(1+$E$24)^D$160+$L61*(1+$F$24)^D$160+$N61*(1+$G$24)^D$160+SUM($O61:$Q61))","v":0},0,0,0,0,0,0,0,0,0,0,0,0,0,0,0,0,0,0,0]
[null,{"$f":"$B$166","v":"Einsparung Instandhaltung"},null,{"$f":"IF($AC94>0,\nIF(D$161<$AC94,0,\nIF($AC94=D$161,(13-$AD94)/12,\nIF(($AC94+$C94)>D$161,1,\nIF(($AC94+$C94)=D$161,(($AD94-1)/12),\n0)))),0)\n*($D127*$L94)*(1+$I$24)^D$160","v":0},0,0,0,0,0,0,0,0,0,0,0,0,0,0,0,0,0,0,0]
[null,{"$f":"$B$167","v":"Vergütung Contractor (inkl. Baukostenzuschuss im Jahr 0)"},{"$f":"-$N$94","v":0},{"$f":"IF($AC94>0,\nIF(D$161<$AC94,0,\nIF($AC94=D$161,(13-$AD94)/12,\nIF(($AC94+$C94)>D$161,1,\nIF(($AC94+$C94)=D$161,(($AD94-1)/12),\n0)))),0)\n*-$H94","v":0},0,0,0,0,0,0,0,0,0,0,0,0,0,0,0,0,0,0,0]
[null,{"$f":"$B$168","v":"Ersatzinvestition inkl. deren Restwert am Ende des Betrachtungszeitraums"},null,{"$f":"IF(AND($AC$94>0,$I$127>0),\nIF($C$94<Nutzungsdauer,\nIF(D$161=$AC$94+$C$94,-$I$127*(1+r_invest)^D$160,\nIF(D$161=$AC$94+Nutzungsdauer,$F$94*(1+r_invest)^D$160*($J$127-(Nutzungsdauer-$C$94))/$J$127,0)),0),0)","v":0},0,0,0,0,0,0,0,0,0,0,0,0,0,0,{"$f":"IF(AND($AC$94>0,$I$127>0),\nIF($C$94<Nutzungsdauer,\nIF(S$161=$AC$94+$C$94,-$I$127*(1+r_invest)^S$160,\nIF(S$161=$AC$94+Nutzungsdauer,$I$127*(1+r_invest)^S$160*($J$127-(Nutzungsdauer-$C$94))/$J$127,0)),0),0)","v":0},0,0,0,0]
[null,"Einsparung CO2-Emissionen",null,{"$f":"IF($AC94>0,\nIF(D$161<$AC94,0,\nIF($AC94=D$161,(13-$AD94)/12,\nIF(($AC94+$C94)>D$161,1,\nIF(($AC94+$C94)=D$161,(($AD94-1)/12+(13-$AD94)/12*$C127),\nIF(($AC94+Nutzungsdauer)>D$161,$C127,\nIF(($AC94+Nutzungsdauer)=D$161,($AD94-1)/12*$C127,\n0)))))),0)\n*($M61*$C$24*(1+$J$24)^D$160)","v":0},0,0,0,0,0,0,0,0,0,0,0,0,0,0,0,0,0,0,0]
[null,{"$f":"$B$170","v":"Nettoersparnis"},{"$f":"SUM(C318:C322)","v":0},0,0,0,0,0,0,0,0,0,0,0,0,0,0,0,0,0,{"$f":"SUM(U318:U322)","v":0},{"$f":"SUM(V318:V322)","v":0},{"$f":"SUM(W318:W322)","v":0}]
[null,"Nettoeinsparung diskontiert (Barwert)",{"$f":"C323","v":0},{"$f":"D323*(1+C$39)^-D$160","v":0},0,0,0,0,0,0,0,0,0,0,0,0,0,0,0,0,0,0,0,null,null,{"$f":"SUM(C324:W324)","v":0}]
[]
[null,{"$f":"B$62","v":"Anbieter 19"}]
[null,{"$f":"$B$165","v":"Einspargarantie Kosten"},null,{"$f":"IF($AC95>0,\nIF(D$161<$AC95,0,\nIF($AC95=D$161,(13-$AD95)/12,\nIF(($AC95+$C95)>D$161,1,\nIF(($AC95+$C95)=D$161,(($AD95-1)/12+(13-$AD95)/12*$C128),\nIF(($AC95+Nutzungsdauer)>D$161,$C128,\nIF(($AC95+Nutzungsdauer)=D$161,($AD95-1)/12*$C128,\n0)))))),0)\n*($J62*(1+$D$24)^D$160+$K62*(1+$E$24)^D$160+$L62*(1+$F$24)^D$160+$N62*(1+$G$24)^D$160+SUM($O62:$Q62))","v":0},0,0,0,0,0,0,0,0,0,0,0,0,0,0,0,0,0,0,0]
[null,{"$f":"$B$166","v":"Einsparung Instandhaltung"},null,{"$f":"IF($AC95>0,\nIF(D$161<$AC95,0,\nIF($AC95=D$161,(13-$AD95)/12,\nIF(($AC95+$C95)>D$161,1,\nIF(($AC95+$C95)=D$161,(($AD95-1)/12),\n0)))),0)\n*($D128*$L95)*(1+$I$24)^D$160","v":0},0,0,0,0,0,0,0,0,0,0,0,0,0,0,0,0,0,0,0]
[null,{"$f":"$B$167","v":"Vergütung Contractor (inkl. Baukostenzuschuss im Jahr 0)"},{"$f":"-$N$95","v":0},{"$f":"IF($AC95>0,\nIF(D$161<$AC95,0,\nIF($AC95=D$161,(13-$AD95)/12,\nIF(($AC95+$C95)>D$161,1,\nIF(($AC95+$C95)=D$161,(($AD95-1)/12),\n0)))),0)\n*-$H95","v":0},0,0,0,0,0,0,0,0,0,0,0,0,0,0,0,0,0,0,0]
[null,{"$f":"$B$168","v":"Ersatzinvestition inkl. deren Restwert am Ende des Betrachtungszeitraums"},null,{"$f":"IF(AND($AC$95>0,$I$128>0),\nIF($C$95<Nutzungsdauer,\nIF(D$161=$AC$95+$C$95,-$I$128*(1+r_invest)^D$160,\nIF(D$161=$AC$95+Nutzungsdauer,$F$95*(1+r_invest)^D$160*($J$128-(Nutzungsdauer-$C$95))/$J$128,0)),0),0)","v":0},0,0,0,0,0,0,0,0,0,0,0,0,0,0,{"$f":"IF(AND($AC$95>0,$I$128>0),\nIF($C$95<Nutzungsdauer,\nIF(S$161=$AC$95+$C$95,-$I$128*(1+r_invest)^S$160,\nIF(S$161=$AC$95+Nutzungsdauer,$I$128*(1+r_invest)^S$160*($J$128-(Nutzungsdauer-$C$95))/$J$128,0)),0),0)","v":0},0,0,0,0]
[null,"Einsparung CO2-Emissionen",null,{"$f":"IF($AC95>0,\nIF(D$161<$AC95,0,\nIF($AC95=D$161,(13-$AD95)/12,\nIF(($AC95+$C95)>D$161,1,\nIF(($AC95+$C95)=D$161,(($AD95-1)/12+(13-$AD95)/12*$C128),\nIF(($AC95+Nutzungsdauer)>D$161,$C128,\nIF(($AC95+Nutzungsdauer)=D$161,($AD95-1)/12*$C128,\n0)))))),0)\n*($M62*$C$24*(1+$J$24)^D$160)","v":0},0,0,0,0,0,0,0,0,0,0,0,0,0,0,0,0,0,0,0]
[null,{"$f":"$B$170","v":"Nettoersparnis"},{"$f":"SUM(C327:C331)","v":0},{"$f":"SUM(D327:D331)","v":0},0,0,0,0,0,0,0,0,0,0,0,0,0,0,0,0,{"$f":"SUM(U327:U331)","v":0},{"$f":"SUM(V327:V331)","v":0},{"$f":"SUM(W327:W331)","v":0}]
[null,"Nettoeinsparung diskontiert (Barwert)",{"$f":"C332","v":0},{"$f":"D332*(1+C$39)^-D$160","v":0},0,0,0,0,0,0,0,0,0,0,0,0,0,0,0,0,0,0,0,null,null,{"$f":"SUM(C333:W333)","v":0}]
[]
[null,{"$f":"B$63","v":"Anbieter 20"}]
[null,{"$f":"$B$165","v":"Einspargarantie Kosten"},null,{"$f":"IF($AC96>0,\nIF(D$161<$AC96,0,\nIF($AC96=D$161,(13-$AD96)/12,\nIF(($AC96+$C96)>D$161,1,\nIF(($AC96+$C96)=D$161,(($AD96-1)/12+(13-$AD96)/12*$C129),\nIF(($AC96+Nutzungsdauer)>D$161,$C129,\nIF(($AC96+Nutzungsdauer)=D$161,($AD96-1)/12*$C129,\n0)))))),0)\n*($J63*(1+$D$24)^D$160+$K63*(1+$E$24)^D$160+$L63*(1+$F$24)^D$160+$N63*(1+$G$24)^D$160+SUM($O63:$Q63))","v":0},0,0,0,0,0,0,0,0,0,0,0,0,0,0,0,0,0,0,0]
[null,{"$f":"$B$166","v":"Einsparung Instandhaltung"},null,{"$f":"IF($AC96>0,\nIF(D$161<$AC96,0,\nIF($AC96=D$161,(13-$AD96)/12,\nIF(($AC96+$C96)>D$161,1,\nIF(($AC96+$C96)=D$161,(($AD96-1)/12),\n0)))),0)\n*($D129*$L96)*(1+$I$24)^D$160","v":0},0,0,0,0,0,0,0,0,0,0,0,0,0,0,0,0,0,0,0]
[null,{"$f":"$B$167","v":"Vergütung Contractor (inkl. Baukostenzuschuss im Jahr 0)"},{"$f":"-$N$96","v":0},{"$f":"IF($AC96>0,\nIF(D$161<$AC96,0,\nIF($AC96=D$161,(13-$AD96)/12,\nIF(($AC96+$C96)>D$161,1,\nIF(($AC96+$C96)=D$161,(($AD96-1)/12),\n0)))),0)\n*-$H96","v":0},0,0,0,0,0,0,0,0,0,0,0,0,0,0,0,0,0,0,0]
[null,{"$f":"$B$168","v":"Ersatzinvestition inkl. deren Restwert am Ende des Betrachtungszeitraums"},null,{"$f":"IF(AND($AC$96>0,$I$129>0),\nIF($C$96<Nutzungsdauer,\nIF(D$161=$AC$96+$C$96,-$I$129*(1+r_invest)^D$160,\nIF(D$161=$AC$96+Nutzungsdauer,$F$96*(1+r_invest)^D$160*($J$129-(Nutzungsdauer-$C$96))/$J$129,0)),0),0)","v":0},0,0,0,0,0,0,0,0,0,0,0,0,0,0,{"$f":"IF(AND($AC$96>0,$I$129>0),\nIF($C$96<Nutzungsdauer,\nIF(S$161=$AC$96+$C$96,-$I$129*(1+r_invest)^S$160,\nIF(S$161=$AC$96+Nutzungsdauer,$I$129*(1+r_invest)^S$160*($J$129-(Nutzungsdauer-$C$96))/$J$129,0)),0),0)","v":0},0,0,0,0]
[null,"Einsparung CO2-Emissionen",null,{"$f":"IF($AC96>0,\nIF(D$161<$AC96,0,\nIF($AC96=D$161,(13-$AD96)/12,\nIF(($AC96+$C96)>D$161,1,\nIF(($AC96+$C96)=D$161,(($AD96-1)/12+(13-$AD96)/12*$C129),\nIF(($AC96+Nutzungsdauer)>D$161,$C129,\nIF(($AC96+Nutzungsdauer)=D$161,($AD96-1)/12*$C129,\n0)))))),0)\n*($M63*$C$24*(1+$J$24)^D$160)","v":0},0,0,0,0,0,0,0,0,0,0,0,0,0,0,0,0,0,0,0]
[null,{"$f":"$B$170","v":"Nettoersparnis"},{"$f":"SUM(C336:C340)","v":0},{"$f":"SUM(D336:D340)","v":0},0,0,0,0,0,0,0,0,0,0,0,0,0,0,0,0,{"$f":"SUM(U336:U340)","v":0},{"$f":"SUM(V336:V340)","v":0},{"$f":"SUM(W336:W340)","v":0}]
[null,"Nettoeinsparung diskontiert (Barwert)",{"$f":"C341","v":0},{"$f":"D341*(1+C$39)^-D$160","v":0},0,0,0,0,0,0,0,0,0,0,0,0,0,0,0,0,0,0,0,null,null,{"$f":"SUM(C342:W342)","v":0}]
[]
[null,{"$f":"B$64","v":"Anbieter 21"}]
[null,{"$f":"$B$165","v":"Einspargarantie Kosten"},null,{"$f":"IF($AC97>0,\nIF(D$161<$AC97,0,\nIF($AC97=D$161,(13-$AD97)/12,\nIF(($AC97+$C97)>D$161,1,\nIF(($AC97+$C97)=D$161,(($AD97-1)/12+(13-$AD97)/12*$C130),\nIF(($AC97+Nutzungsdauer)>D$161,$C130,\nIF(($AC97+Nutzungsdauer)=D$161,($AD97-1)/12*$C130,\n0)))))),0)\n*($J64*(1+$D$24)^D$160+$K64*(1+$E$24)^D$160+$L64*(1+$F$24)^D$160+$N64*(1+$G$24)^D$160+SUM($O64:$Q64))","v":0},0,0,0,0,0,0,0,0,0,0,0,0,0,0,0,0,0,0,0]
[null,{"$f":"$B$166","v":"Einsparung Instandhaltung"},null,{"$f":"IF($AC97>0,\nIF(D$161<$AC97,0,\nIF($AC97=D$161,(13-$AD97)/12,\nIF(($AC97+$C97)>D$161,1,\nIF(($AC97+$C97)=D$161,(($AD97-1)/12),\n0)))),0)\n*($D130*$L97)*(1+$I$24)^D$160","v":0},0,0,0,0,0,0,0,0,0,0,0,0,0,0,0,0,0,0,0]
[null,{"$f":"$B$167","v":"Vergütung Contractor (inkl. Baukostenzuschuss im Jahr 0)"},{"$f":"-$N$97","v":0},{"$f":"IF($AC97>0,\nIF(D$161<$AC97,0,\nIF($AC97=D$161,(13-$AD97)/12,\nIF(($AC97+$C97)>D$161,1,\nIF(($AC97+$C97)=D$161,(($AD97-1)/12),\n0)))),0)\n*-$H97","v":0},0,0,0,0,0,0,0,0,0,0,0,0,0,0,0,0,0,0,0]
[null,{"$f":"$B$168","v":"Ersatzinvestition inkl. deren Restwert am Ende des Betrachtungszeitraums"},null,{"$f":"IF(AND($AC$97>0,$I$130>0),\nIF($C$97<Nutzungsdauer,\nIF(D$161=$AC$97+$C$97,-$I$130*(1+r_invest)^D$160,\nIF(D$161=$AC$97+Nutzungsdauer,$F$97*(1+r_invest)^D$160*($J$130-(Nutzungsdauer-$C$97))/$J$130,0)),0),0)","v":0},0,0,0,0,0,0,0,0,0,0,0,0,0,0,{"$f":"IF(AND($AC$97>0,$I$130>0),\nIF($C$97<Nutzungsdauer,\nIF(S$161=$AC$97+$C$97,-$I$130*(1+r_invest)^S$160,\nIF(S$161=$AC$97+Nutzungsdauer,$I$130*(1+r_invest)^S$160*($J$130-(Nutzungsdauer-$C$97))/$J$130,0)),0),0)","v":0},0,0,0,0]
[null,"Einsparung CO2-Emissionen",null,{"$f":"IF($AC97>0,\nIF(D$161<$AC97,0,\nIF($AC97=D$161,(13-$AD97)/12,\nIF(($AC97+$C97)>D$161,1,\nIF(($AC97+$C97)=D$161,(($AD97-1)/12+(13-$AD97)/12*$C130),\nIF(($AC97+Nutzungsdauer)>D$161,$C130,\nIF(($AC97+Nutzungsdauer)=D$161,($AD97-1)/12*$C130,\n0)))))),0)\n*($M64*$C$24*(1+$J$24)^D$160)","v":0},0,0,0,0,0,0,0,0,0,0,0,0,0,0,0,0,0,0,0]
[null,{"$f":"$B$170","v":"Nettoersparnis"},{"$f":"SUM(C345:C349)","v":0},0,0,0,0,0,0,0,0,0,0,0,0,0,0,0,0,0,{"$f":"SUM(U345:U349)","v":0},{"$f":"SUM(V345:V349)","v":0},{"$f":"SUM(W345:W349)","v":0}]
[null,"Nettoeinsparung diskontiert (Barwert)",{"$f":"C350","v":0},{"$f":"D350*(1+C$39)^-D$160","v":0},0,0,0,0,0,0,0,0,0,0,0,0,0,0,0,0,0,0,0,null,null,{"$f":"SUM(C351:W351)","v":0}]
[]
[null,{"$f":"B$65","v":"Anbieter 22"}]
[null,{"$f":"$B$165","v":"Einspargarantie Kosten"},null,{"$f":"IF($AC98>0,\nIF(D$161<$AC98,0,\nIF($AC98=D$161,(13-$AD98)/12,\nIF(($AC98+$C98)>D$161,1,\nIF(($AC98+$C98)=D$161,(($AD98-1)/12+(13-$AD98)/12*$C131),\nIF(($AC98+Nutzungsdauer)>D$161,$C131,\nIF(($AC98+Nutzungsdauer)=D$161,($AD98-1)/12*$C131,\n0)))))),0)\n*($J65*(1+$D$24)^D$160+$K65*(1+$E$24)^D$160+$L65*(1+$F$24)^D$160+$N65*(1+$G$24)^D$160+SUM($O65:$Q65))","v":0},0,0,0,0,0,0,0,0,0,0,0,0,0,0,0,0,0,0,0]
[null,{"$f":"$B$166","v":"Einsparung Instandhaltung"},null,{"$f":"IF($AC98>0,\nIF(D$161<$AC98,0,\nIF($AC98=D$161,(13-$AD98)/12,\nIF(($AC98+$C98)>D$161,1,\nIF(($AC98+$C98)=D$161,(($AD98-1)/12),\n0)))),0)\n*($D131*$L98)*(1+$I$24)^D$160","v":0},0,0,0,0,0,0,0,0,0,0,0,0,0,0,0,0,0,0,0]
[null,{"$f":"$B$167","v":"Vergütung Contractor (inkl. Baukostenzuschuss im Jahr 0)"},{"$f":"-$N$98","v":0},{"$f":"IF($AC98>0,\nIF(D$161<$AC98,0,\nIF($AC98=D$161,(13-$AD98)/12,\nIF(($AC98+$C98)>D$161,1,\nIF(($AC98+$C98)=D$161,(($AD98-1)/12),\n0)))),0)\n*-$H98","v":0},0,0,0,0,0,0,0,0,0,0,0,0,0,0,0,0,0,0,0]
[null,{"$f":"$B$168","v":"Ersatzinvestition inkl. deren Restwert am Ende des Betrachtungszeitraums"},null,{"$f":"IF(AND($AC$98>0,$I$131>0),\nIF($C$98<Nutzungsdauer,\nIF(D$161=$AC$98+$C$98,-$I$131*(1+r_invest)^D$160,\nIF(D$161=$AC$98+Nutzungsdauer,$F$98*(1+r_invest)^D$160*($J$131-(Nutzungsdauer-$C$98))/$J$131,0)),0),0)","v":0},0,0,0,0,0,0,0,0,0,0,0,0,0,0,{"$f":"IF(AND($AC$98>0,$I$131>0),\nIF($C$98<Nutzungsdauer,\nIF(S$161=$AC$98+$C$98,-$I$131*(1+r_invest)^S$160,\nIF(S$161=$AC$98+Nutzungsdauer,$I$131*(1+r_invest)^S$160*($J$131-(Nutzungsdauer-$C$98))/$J$131,0)),0),0)","v":0},0,0,0,0]
[null,"Einsparung CO2-Emissionen",null,{"$f":"IF($AC98>0,\nIF(D$161<$AC98,0,\nIF($AC98=D$161,(13-$AD98)/12,\nIF(($AC98+$C98)>D$161,1,\nIF(($AC98+$C98)=D$161,(($AD98-1)/12+(13-$AD98)/12*$C131),\nIF(($AC98+Nutzungsdauer)>D$161,$C131,\nIF(($AC98+Nutzungsdauer)=D$161,($AD98-1)/12*$C131,\n0)))))),0)\n*($M65*$C$24*(1+$J$24)^D$160)","v":0},0,0,0,0,0,0,0,0,0,0,0,0,0,0,0,0,0,0,0]
[null,{"$f":"$B$170","v":"Nettoersparnis"},{"$f":"SUM(C354:C358)","v":0},0,0,0,0,0,0,0,0,0,0,0,0,0,0,0,0,0,{"$f":"SUM(U354:U358)","v":0},{"$f":"SUM(V354:V358)","v":0},{"$f":"SUM(W354:W358)","v":0}]
[null,"Nettoeinsparung diskontiert (Barwert)",{"$f":"C359","v":0},{"$f":"D359*(1+C$39)^-D$160","v":0},0,0,0,0,0,0,0,0,0,0,0,0,0,0,0,0,0,0,0,null,null,{"$f":"SUM(C360:W360)","v":0}]
[]
[null,{"$f":"B$66","v":"Anbieter 23"}]
[null,{"$f":"$B$165","v":"Einspargarantie Kosten"},null,{"$f":"IF($AC99>0,\nIF(D$161<$AC99,0,\nIF($AC99=D$161,(13-$AD99)/12,\nIF(($AC99+$C99)>D$161,1,\nIF(($AC99+$C99)=D$161,(($AD99-1)/12+(13-$AD99)/12*$C132),\nIF(($AC99+Nutzungsdauer)>D$161,$C132,\nIF(($AC99+Nutzungsdauer)=D$161,($AD99-1)/12*$C132,\n0)))))),0)\n*($J66*(1+$D$24)^D$160+$K66*(1+$E$24)^D$160+$L66*(1+$F$24)^D$160+$N66*(1+$G$24)^D$160+SUM($O66:$Q66))","v":0},0,0,0,0,0,0,0,0,0,0,0,0,0,0,0,0,0,0,0]
[null,{"$f":"$B$166","v":"Einsparung Instandhaltung"},null,{"$f":"IF($AC99>0,\nIF(D$161<$AC99,0,\nIF($AC99=D$161,(13-$AD99)/12,\nIF(($AC99+$C99)>D$161,1,\nIF(($AC99+$C99)=D$161,(($AD99-1)/12),\n0)))),0)\n*($D132*$L99)*(1+$I$24)^D$160","v":0},0,0,0,0,0,0,0,0,0,0,0,0,0,0,0,0,0,0,0]
[null,{"$f":"$B$167","v":"Vergütung Contractor (inkl. Baukostenzuschuss im Jahr 0)"},{"$f":"-$N$99","v":0},{"$f":"IF($AC99>0,\nIF(D$161<$AC99,0,\nIF($AC99=D$161,(13-$AD99)/12,\nIF(($AC99+$C99)>D$161,1,\nIF(($AC99+$C99)=D$161,(($AD99-1)/12),\n0)))),0)\n*-$H99","v":0},0,0,0,0,0,0,0,0,0,0,0,0,0,0,0,0,0,0,0]
[null,{"$f":"$B$168","v":"Ersatzinvestition inkl. deren Restwert am Ende des Betrachtungszeitraums"},null,{"$f":"IF(AND($AC$99>0,$I$132>0),\nIF($C$99<Nutzungsdauer,\nIF(D$161=$AC$99+$C$99,-$I$132*(1+r_invest)^D$160,\nIF(D$161=$AC$99+Nutzungsdauer,$F$99*(1+r_invest)^D$160*($J$132-(Nutzungsdauer-$C$99))/$J$132,0)),0),0)","v":0},0,0,0,0,0,0,0,0,0,0,0,0,0,0,{"$f":"IF(AND($AC$99>0,$I$132>0),\nIF($C$99<Nutzungsdauer,\nIF(S$161=$AC$99+$C$99,-$I$132*(1+r_invest)^S$160,\nIF(S$161=$AC$99+Nutzungsdauer,$I$132*(1+r_invest)^S$160*($J$132-(Nutzungsdauer-$C$99))/$J$132,0)),0),0)","v":0},0,0,0,0]
[null,"Einsparung CO2-Emissionen",null,{"$f":"IF($AC99>0,\nIF(D$161<$AC99,0,\nIF($AC99=D$161,(13-$AD99)/12,\nIF(($AC99+$C99)>D$161,1,\nIF(($AC99+$C99)=D$161,(($AD99-1)/12+(13-$AD99)/12*$C132),\nIF(($AC99+Nutzungsdauer)>D$161,$C132,\nIF(($AC99+Nutzungsdauer)=D$161,($AD99-1)/12*$C132,\n0)))))),0)\n*($M66*$C$24*(1+$J$24)^D$160)","v":0},0,0,0,0,0,0,0,0,0,0,0,0,0,0,0,0,0,0,0]
[null,{"$f":"$B$170","v":"Nettoersparnis"},{"$f":"SUM(C363:C367)","v":0},0,0,0,0,0,0,0,0,0,0,0,0,0,0,0,0,0,{"$f":"SUM(U363:U367)","v":0},{"$f":"SUM(V363:V367)","v":0},{"$f":"SUM(W363:W367)","v":0}]
[null,"Nettoeinsparung diskontiert (Barwert)",{"$f":"C368","v":0},{"$f":"D368*(1+C$39)^-D$160","v":0},0,0,0,0,0,0,0,0,0,0,0,0,0,0,0,0,0,0,0,null,null,{"$f":"SUM(C369:W369)","v":0}]
[]
[null,{"$f":"B$67","v":"Anbieter 24"}]
[null,{"$f":"$B$165","v":"Einspargarantie Kosten"},null,{"$f":"IF($AC100>0,\nIF(D$161<$AC100,0,\nIF($AC100=D$161,(13-$AD100)/12,\nIF(($AC100+$C100)>D$161,1,\nIF(($AC100+$C100)=D$161,(($AD100-1)/12+(13-$AD100)/12*$C133),\nIF(($AC100+Nutzungsdauer)>D$161,$C133,\nIF(($AC100+Nutzungsdauer)=D$161,($AD100-1)/12*$C133,\n0)))))),0)\n*($J67*(1+$D$24)^D$160+$K67*(1+$E$24)^D$160+$L67*(1+$F$24)^D$160+$N67*(1+$G$24)^D$160+SUM($O67:$Q67))","v":0},0,0,0,0,0,0,0,0,0,0,0,0,0,0,0,0,0,0,0]
[null,{"$f":"$B$166","v":"Einsparung Instandhaltung"},null,{"$f":"IF($AC100>0,\nIF(D$161<$AC100,0,\nIF($AC100=D$161,(13-$AD100)/12,\nIF(($AC100+$C100)>D$161,1,\nIF(($AC100+$C100)=D$161,(($AD100-1)/12),\n0)))),0)\n*($D133*$L100)*(1+$I$24)^D$160","v":0},0,0,0,0,0,0,0,0,0,0,0,0,0,0,0,0,0,0,0]
[null,{"$f":"$B$167","v":"Vergütung Contractor (inkl. Baukostenzuschuss im Jahr 0)"},{"$f":"-$N$100","v":0},{"$f":"IF($AC100>0,\nIF(D$161<$AC100,0,\nIF($AC100=D$161,(13-$AD100)/12,\nIF(($AC100+$C100)>D$161,1,\nIF(($AC100+$C100)=D$161,(($AD100-1)/12),\n0)))),0)\n*-$H100","v":0},0,0,0,0,0,0,0,0,0,0,0,0,0,0,0,0,0,0,0]
[null,{"$f":"$B$168","v":"Ersatzinvestition inkl. deren Restwert am Ende des Betrachtungszeitraums"},null,{"$f":"IF(AND($AC$100>0,$I$133>0),\nIF($C$100<Nutzungsdauer,\nIF(D$161=$AC$100+$C$100,-$I$133*(1+r_invest)^D$160,\nIF(D$161=$AC$100+Nutzungsdauer,$F$100*(1+r_invest)^D$160*($J$133-(Nutzungsdauer-$C$100))/$J$133,0)),0),0)","v":0},0,0,0,0,0,0,0,0,0,0,0,0,0,0,{"$f":"IF(AND($AC$100>0,$I$133>0),\nIF($C$100<Nutzungsdauer,\nIF(S$161=$AC$100+$C$100,-$I$133*(1+r_invest)^S$160,\nIF(S$161=$AC$100+Nutzungsdauer,$I$133*(1+r_invest)^S$160*($J$133-(Nutzungsdauer-$C$100))/$J$133,0)),0),0)","v":0},0,0,0,0]
[null,"Einsparung CO2-Emissionen",null,{"$f":"IF($AC100>0,\nIF(D$161<$AC100,0,\nIF($AC100=D$161,(13-$AD100)/12,\nIF(($AC100+$C100)>D$161,1,\nIF(($AC100+$C100)=D$161,(($AD100-1)/12+(13-$AD100)/12*$C133),\nIF(($AC100+Nutzungsdauer)>D$161,$C133,\nIF(($AC100+Nutzungsdauer)=D$161,($AD100-1)/12*$C133,\n0)))))),0)\n*($M67*$C$24*(1+$J$24)^D$160)","v":0},0,0,0,0,0,0,0,0,0,0,0,0,0,0,0,0,0,0,0]
[null,{"$f":"$B$170","v":"Nettoersparnis"},{"$f":"SUM(C372:C376)","v":0},0,0,0,0,0,0,0,0,0,0,0,0,0,0,0,0,0,{"$f":"SUM(U372:U376)","v":0},{"$f":"SUM(V372:V376)","v":0},{"$f":"SUM(W372:W376)","v":0}]
[null,"Nettoeinsparung diskontiert (Barwert)",{"$f":"C377","v":0},{"$f":"D377*(1+C$39)^-D$160","v":0},0,0,0,0,0,0,0,0,0,0,0,0,0,0,0,0,0,0,0,null,null,{"$f":"SUM(C378:W378)","v":0}]
[]
[null,{"$f":"B$68","v":"Anbieter 25"}]
[null,{"$f":"$B$165","v":"Einspargarantie Kosten"},null,{"$f":"IF($AC101>0,\nIF(D$161<$AC101,0,\nIF($AC101=D$161,(13-$AD101)/12,\nIF(($AC101+$C101)>D$161,1,\nIF(($AC101+$C101)=D$161,(($AD101-1)/12+(13-$AD101)/12*$C134),\nIF(($AC101+Nutzungsdauer)>D$161,$C134,\nIF(($AC101+Nutzungsdauer)=D$161,($AD101-1)/12*$C134,\n0)))))),0)\n*($J68*(1+$D$24)^D$160+$K68*(1+$E$24)^D$160+$L68*(1+$F$24)^D$160+$N68*(1+$G$24)^D$160+SUM($O68:$Q68))","v":0},0,0,0,0,0,0,0,0,0,0,0,0,0,0,0,0,0,0,0]
[null,{"$f":"$B$166","v":"Einsparung Instandhaltung"},null,{"$f":"IF($AC101>0,\nIF(D$161<$AC101,0,\nIF($AC101=D$161,(13-$AD101)/12,\nIF(($AC101+$C101)>D$161,1,\nIF(($AC101+$C101)=D$161,(($AD101-1)/12),\n0)))),0)\n*($D134*$L101)*(1+$I$24)^D$160","v":0},0,0,0,0,0,0,0,0,0,0,0,0,0,0,0,0,0,0,0]
[null,{"$f":"$B$167","v":"Vergütung Contractor (inkl. Baukostenzuschuss im Jahr 0)"},{"$f":"-$N$101","v":0},{"$f":"IF($AC101>0,\nIF(D$161<$AC101,0,\nIF($AC101=D$161,(13-$AD101)/12,\nIF(($AC101+$C101)>D$161,1,\nIF(($AC101+$C101)=D$161,(($AD101-1)/12),\n0)))),0)\n*-$H101","v":0},0,0,0,0,0,0,0,0,0,0,0,0,0,0,0,0,0,0,0]
[null,{"$f":"$B$168","v":"Ersatzinvestition inkl. deren Restwert am Ende des Betrachtungszeitraums"},null,{"$f":"IF(AND($AC$101>0,$I$134>0),\nIF($C$101<Nutzungsdauer,\nIF(D$161=$AC$101+$C$101,-$I$134*(1+r_invest)^D$160,\nIF(D$161=$AC$101+Nutzungsdauer,$F$101*(1+r_invest)^D$160*($J$134-(Nutzungsdauer-$C$101))/$J$134,0)),0),0)","v":0},0,0,0,0,0,0,0,0,0,0,0,0,0,0,{"$f":"IF(AND($AC$101>0,$I$134>0),\nIF($C$101<Nutzungsdauer,\nIF(S$161=$AC$101+$C$101,-$I$134*(1+r_invest)^S$160,\nIF(S$161=$AC$101+Nutzungsdauer,$I$134*(1+r_invest)^S$160*($J$134-(Nutzungsdauer-$C$101))/$J$134,0)),0),0)","v":0},0,0,0,0]
[null,"Einsparung CO2-Emissionen",null,{"$f":"IF($AC101>0,\nIF(D$161<$AC101,0,\nIF($AC101=D$161,(13-$AD101)/12,\nIF(($AC101+$C101)>D$161,1,\nIF(($AC101+$C101)=D$161,(($AD101-1)/12+(13-$AD101)/12*$C134),\nIF(($AC101+Nutzungsdauer)>D$161,$C134,\nIF(($AC101+Nutzungsdauer)=D$161,($AD101-1)/12*$C134,\n0)))))),0)\n*($M68*$C$24*(1+$J$24)^D$160)","v":0},0,0,0,0,0,0,0,0,0,0,0,0,0,0,0,0,0,0,0]
[null,{"$f":"$B$170","v":"Nettoersparnis"},{"$f":"SUM(C381:C385)","v":0},0,0,0,0,0,0,0,0,0,0,0,0,0,0,0,0,0,{"$f":"SUM(U381:U385)","v":0},{"$f":"SUM(V381:V385)","v":0},{"$f":"SUM(W381:W385)","v":0}]
[null,"Nettoeinsparung diskontiert (Barwert)",{"$f":"C386","v":0},{"$f":"D386*(1+C$39)^-D$160","v":0},0,0,0,0,0,0,0,0,0,0,0,0,0,0,0,0,0,0,0,null,null,{"$f":"SUM(C387:W387)","v":0}]
[]
[null,{"$f":"B$69","v":"Anbieter 26"}]
[null,{"$f":"$B$165","v":"Einspargarantie Kosten"},null,{"$f":"IF($AC102>0,\nIF(D$161<$AC102,0,\nIF($AC102=D$161,(13-$AD102)/12,\nIF(($AC102+$C102)>D$161,1,\nIF(($AC102+$C102)=D$161,(($AD102-1)/12+(13-$AD102)/12*$C135),\nIF(($AC102+Nutzungsdauer)>D$161,$C135,\nIF(($AC102+Nutzungsdauer)=D$161,($AD102-1)/12*$C135,\n0)))))),0)\n*($J69*(1+$D$24)^D$160+$K69*(1+$E$24)^D$160+$L69*(1+$F$24)^D$160+$N69*(1+$G$24)^D$160+SUM($O69:$Q69))","v":0},0,0,0,0,0,0,0,0,0,0,0,0,0,0,0,0,0,0,0]
[null,{"$f":"$B$166","v":"Einsparung Instandhaltung"},null,{"$f":"IF($AC102>0,\nIF(D$161<$AC102,0,\nIF($AC102=D$161,(13-$AD102)/12,\nIF(($AC102+$C102)>D$161,1,\nIF(($AC102+$C102)=D$161,(($AD102-1)/12),\n0)))),0)\n*($D135*$L102)*(1+$I$24)^D$160","v":0},0,0,0,0,0,0,0,0,0,0,0,0,0,0,0,0,0,0,0]
[null,{"$f":"$B$167","v":"Vergütung Contractor (inkl. Baukostenzuschuss im Jahr 0)"},{"$f":"-$N$102","v":0},{"$f":"IF($AC102>0,\nIF(D$161<$AC102,0,\nIF($AC102=D$161,(13-$AD102)/12,\nIF(($AC102+$C102)>D$161,1,\nIF(($AC102+$C102)=D$161,(($AD102-1)/12),\n0)))),0)\n*-$H102","v":0},0,0,0,0,0,0,0,0,0,0,0,0,0,0,0,0,0,0,0]
[null,{"$f":"$B$168","v":"Ersatzinvestition inkl. deren Restwert am Ende des Betrachtungszeitraums"},null,{"$f":"IF(AND($AC$102>0,$I$135>0),\nIF($C$102<Nutzungsdauer,\nIF(D$161=$AC$102+$C$102,-$I$135*(1+r_invest)^D$160,\nIF(D$161=$AC$102+Nutzungsdauer,$F$102*(1+r_invest)^D$160*($J$135-(Nutzungsdauer-$C$102))/$J$135,0)),0),0)","v":0},0,0,0,0,0,0,0,0,0,0,0,0,0,0,{"$f":"IF(AND($AC$102>0,$I$135>0),\nIF($C$102<Nutzungsdauer,\nIF(S$161=$AC$102+$C$102,-$I$135*(1+r_invest)^S$160,\nIF(S$161=$AC$102+Nutzungsdauer,$I$135*(1+r_invest)^S$160*($J$135-(Nutzungsdauer-$C$102))/$J$135,0)),0),0)","v":0},0,0,0,0]
[null,"Einsparung CO2-Emissionen",null,{"$f":"IF($AC102>0,\nIF(D$161<$AC102,0,\nIF($AC102=D$161,(13-$AD102)/12,\nIF(($AC102+$C102)>D$161,1,\nIF(($AC102+$C102)=D$161,(($AD102-1)/12+(13-$AD102)/12*$C135),\nIF(($AC102+Nutzungsdauer)>D$161,$C135,\nIF(($AC102+Nutzungsdauer)=D$161,($AD102-1)/12*$C135,\n0)))))),0)\n*($M69*$C$24*(1+$J$24)^D$160)","v":0},0,0,0,0,0,0,0,0,0,0,0,0,0,0,0,0,0,0,0]
[null,{"$f":"$B$170","v":"Nettoersparnis"},{"$f":"SUM(C390:C394)","v":0},0,0,0,0,0,0,0,0,0,0,0,0,0,0,0,0,0,{"$f":"SUM(U390:U394)","v":0},{"$f":"SUM(V390:V394)","v":0},{"$f":"SUM(W390:W394)","v":0}]
[null,"Nettoeinsparung diskontiert (Barwert)",{"$f":"C395","v":0},{"$f":"D395*(1+C$39)^-D$160","v":0},0,0,0,0,0,0,0,0,0,0,0,0,0,0,0,0,0,0,0,null,null,{"$f":"SUM(C396:W396)","v":0}]
[]
[null,{"$f":"B$70","v":"Anbieter 27"}]
[null,{"$f":"$B$165","v":"Einspargarantie Kosten"},null,{"$f":"IF($AC103>0,\nIF(D$161<$AC103,0,\nIF($AC103=D$161,(13-$AD103)/12,\nIF(($AC103+$C103)>D$161,1,\nIF(($AC103+$C103)=D$161,(($AD103-1)/12+(13-$AD103)/12*$C136),\nIF(($AC103+Nutzungsdauer)>D$161,$C136,\nIF(($AC103+Nutzungsdauer)=D$161,($AD103-1)/12*$C136,\n0)))))),0)\n*($J70*(1+$D$24)^D$160+$K70*(1+$E$24)^D$160+$L70*(1+$F$24)^D$160+$N70*(1+$G$24)^D$160+SUM($O70:$Q70))","v":0},0,0,0,0,0,0,0,0,0,0,0,0,0,0,0,0,0,0,0]
[null,{"$f":"$B$166","v":"Einsparung Instandhaltung"},null,{"$f":"IF($AC103>0,\nIF(D$161<$AC103,0,\nIF($AC103=D$161,(13-$AD103)/12,\nIF(($AC103+$C103)>D$161,1,\nIF(($AC103+$C103)=D$161,(($AD103-1)/12),\n0)))),0)\n*($D136*$L103)*(1+$I$24)^D$160","v":0},0,0,0,0,0,0,0,0,0,0,0,0,0,0,0,0,0,0,0]
[null,{"$f":"$B$167","v":"Vergütung Contractor (inkl. Baukostenzuschuss im Jahr 0)"},{"$f":"-$N$103","v":0},{"$f":"IF($AC103>0,\nIF(D$161<$AC103,0,\nIF($AC103=D$161,(13-$AD103)/12,\nIF(($AC103+$C103)>D$161,1,\nIF(($AC103+$C103)=D$161,(($AD103-1)/12),\n0)))),0)\n*-$H103","v":0},0,0,0,0,0,0,0,0,0,0,0,0,0,0,0,0,0,0,0]
[null,{"$f":"$B$168","v":"Ersatzinvestition inkl. deren Restwert am Ende des Betrachtungszeitraums"},null,{"$f":"IF(AND($AC$103>0,$I$136>0),\nIF($C$103<Nutzungsdauer,\nIF(D$161=$AC$103+$C$103,-$I$136*(1+r_invest)^D$160,\nIF(D$161=$AC$103+Nutzungsdauer,$F$103*(1+r_invest)^D$160*($J$136-(Nutzungsdauer-$C$103))/$J$136,0)),0),0)","v":0},0,0,0,0,0,0,0,0,0,0,0,0,0,0,{"$f":"IF(AND($AC$103>0,$I$136>0),\nIF($C$103<Nutzungsdauer,\nIF(S$161=$AC$103+$C$103,-$I$136*(1+r_invest)^S$160,\nIF(S$161=$AC$103+Nutzungsdauer,$I$136*(1+r_invest)^S$160*($J$136-(Nutzungsdauer-$C$103))/$J$136,0)),0),0)","v":0},0,0,0,0]
[null,"Einsparung CO2-Emissionen",null,{"$f":"IF($AC103>0,\nIF(D$161<$AC103,0,\nIF($AC103=D$161,(13-$AD103)/12,\nIF(($AC103+$C103)>D$161,1,\nIF(($AC103+$C103)=D$161,(($AD103-1)/12+(13-$AD103)/12*$C136),\nIF(($AC103+Nutzungsdauer)>D$161,$C136,\nIF(($AC103+Nutzungsdauer)=D$161,($AD103-1)/12*$C136,\n0)))))),0)\n*($M70*$C$24*(1+$J$24)^D$160)","v":0},0,0,0,0,0,0,0,0,0,0,0,0,0,0,0,0,0,0,0]
[null,{"$f":"$B$170","v":"Nettoersparnis"},{"$f":"SUM(C399:C403)","v":0},0,0,0,0,0,0,0,0,0,0,0,0,0,0,0,0,0,{"$f":"SUM(U399:U403)","v":0},{"$f":"SUM(V399:V403)","v":0},{"$f":"SUM(W399:W403)","v":0}]
[null,"Nettoeinsparung diskontiert (Barwert)",{"$f":"C404","v":0},{"$f":"D404*(1+C$39)^-D$160","v":0},0,0,0,0,0,0,0,0,0,0,0,0,0,0,0,0,0,0,0,null,null,{"$f":"SUM(C405:W405)","v":0}]
[]
[null,{"$f":"B$71","v":"Anbieter 28"}]
[null,{"$f":"$B$165","v":"Einspargarantie Kosten"},null,{"$f":"IF($AC104>0,\nIF(D$161<$AC104,0,\nIF($AC104=D$161,(13-$AD104)/12,\nIF(($AC104+$C104)>D$161,1,\nIF(($AC104+$C104)=D$161,(($AD104-1)/12+(13-$AD104)/12*$C137),\nIF(($AC104+Nutzungsdauer)>D$161,$C137,\nIF(($AC104+Nutzungsdauer)=D$161,($AD104-1)/12*$C137,\n0)))))),0)\n*($J71*(1+$D$24)^D$160+$K71*(1+$E$24)^D$160+$L71*(1+$F$24)^D$160+$N71*(1+$G$24)^D$160+SUM($O71:$Q71))","v":0},0,0,0,0,0,0,0,0,0,0,0,0,0,0,0,0,0,0,0]
[null,{"$f":"$B$166","v":"Einsparung Instandhaltung"},null,{"$f":"IF($AC104>0,\nIF(D$161<$AC104,0,\nIF($AC104=D$161,(13-$AD104)/12,\nIF(($AC104+$C104)>D$161,1,\nIF(($AC104+$C104)=D$161,(($AD104-1)/12),\n0)))),0)\n*($D137*$L104)*(1+$I$24)^D$160","v":0},0,0,0,0,0,0,0,0,0,0,0,0,0,0,0,0,0,0,0]
[null,{"$f":"$B$167","v":"Vergütung Contractor (inkl. Baukostenzuschuss im Jahr 0)"},{"$f":"-$N$104","v":0},{"$f":"IF($AC104>0,\nIF(D$161<$AC104,0,\nIF($AC104=D$161,(13-$AD104)/12,\nIF(($AC104+$C104)>D$161,1,\nIF(($AC104+$C104)=D$161,(($AD104-1)/12),\n0)))),0)\n*-$H104","v":0},0,0,0,0,0,0,0,0,0,0,0,0,0,0,0,0,0,0,0]
[null,{"$f":"$B$168","v":"Ersatzinvestition inkl. deren Restwert am Ende des Betrachtungszeitraums"},null,{"$f":"IF(AND($AC$104>0,$I$137>0),\nIF($C$104<Nutzungsdauer,\nIF(D$161=$AC$104+$C$104,-$I$137*(1+r_invest)^D$160,\nIF(D$161=$AC$104+Nutzungsdauer,$F$104*(1+r_invest)^D$160*($J$137-(Nutzungsdauer-$C$104))/$J$137,0)),0),0)","v":0},0,0,0,0,0,0,0,0,0,0,0,0,0,0,{"$f":"IF(AND($AC$104>0,$I$137>0),\nIF($C$104<Nutzungsdauer,\nIF(S$161=$AC$104+$C$104,-$I$137*(1+r_invest)^S$160,\nIF(S$161=$AC$104+Nutzungsdauer,$I$137*(1+r_invest)^S$160*($J$137-(Nutzungsdauer-$C$104))/$J$137,0)),0),0)","v":0},0,0,0,0]
[null,"Einsparung CO2-Emissionen",null,{"$f":"IF($AC104>0,\nIF(D$161<$AC104,0,\nIF($AC104=D$161,(13-$AD104)/12,\nIF(($AC104+$C104)>D$161,1,\nIF(($AC104+$C104)=D$161,(($AD104-1)/12+(13-$AD104)/12*$C137),\nIF(($AC104+Nutzungsdauer)>D$161,$C137,\nIF(($AC104+Nutzungsdauer)=D$161,($AD104-1)/12*$C137,\n0)))))),0)\n*($M71*$C$24*(1+$J$24)^D$160)","v":0},0,0,0,0,0,0,0,0,0,0,0,0,0,0,0,0,0,0,0]
[null,{"$f":"$B$170","v":"Nettoersparnis"},{"$f":"SUM(C408:C412)","v":0},0,0,0,0,0,0,0,0,0,0,0,0,0,0,0,0,0,{"$f":"SUM(U408:U412)","v":0},{"$f":"SUM(V408:V412)","v":0},{"$f":"SUM(W408:W412)","v":0}]
[null,"Nettoeinsparung diskontiert (Barwert)",{"$f":"C413","v":0},{"$f":"D413*(1+C$39)^-D$160","v":0},0,0,0,0,0,0,0,0,0,0,0,0,0,0,0,0,0,0,0,null,null,{"$f":"SUM(C414:W414)","v":0}]
[]
[null,{"$f":"B$72","v":"Anbieter 29"}]
[null,{"$f":"$B$165","v":"Einspargarantie Kosten"},null,{"$f":"IF($AC105>0,\nIF(D$161<$AC105,0,\nIF($AC105=D$161,(13-$AD105)/12,\nIF(($AC105+$C105)>D$161,1,\nIF(($AC105+$C105)=D$161,(($AD105-1)/12+(13-$AD105)/12*$C138),\nIF(($AC105+Nutzungsdauer)>D$161,$C138,\nIF(($AC105+Nutzungsdauer)=D$161,($AD105-1)/12*$C138,\n0)))))),0)\n*($J72*(1+$D$24)^D$160+$K72*(1+$E$24)^D$160+$L72*(1+$F$24)^D$160+$N72*(1+$G$24)^D$160+SUM($O72:$Q72))","v":0},0,0,0,0,0,0,0,0,0,0,0,0,0,0,0,0,0,0,0]
[null,{"$f":"$B$166","v":"Einsparung Instandhaltung"},null,{"$f":"IF($AC105>0,\nIF(D$161<$AC105,0,\nIF($AC105=D$161,(13-$AD105)/12,\nIF(($AC105+$C105)>D$161,1,\nIF(($AC105+$C105)=D$161,(($AD105-1)/12),\n0)))),0)\n*($D138*$L105)*(1+$I$24)^D$160","v":0},0,0,0,0,0,0,0,0,0,0,0,0,0,0,0,0,0,0,0]
[null,{"$f":"$B$167","v":"Vergütung Contractor (inkl. Baukostenzuschuss im Jahr 0)"},{"$f":"-$N$105","v":0},{"$f":"IF($AC105>0,\nIF(D$161<$AC105,0,\nIF($AC105=D$161,(13-$AD105)/12,\nIF(($AC105+$C105)>D$161,1,\nIF(($AC105+$C105)=D$161,(($AD105-1)/12),\n0)))),0)\n*-$H105","v":0},0,0,0,0,0,0,0,0,0,0,0,0,0,0,0,0,0,0,0]
[null,{"$f":"$B$168","v":"Ersatzinvestition inkl. deren Restwert am Ende des Betrachtungszeitraums"},null,{"$f":"IF(AND($AC$105>0,$I$138>0),\nIF($C$105<Nutzungsdauer,\nIF(D$161=$AC$105+$C$105,-$I$138*(1+r_invest)^D$160,\nIF(D$161=$AC$105+Nutzungsdauer,$F$105*(1+r_invest)^D$160*($J$138-(Nutzungsdauer-$C$105))/$J$138,0)),0),0)","v":0},0,0,0,0,0,0,0,0,0,0,0,0,0,0,{"$f":"IF(AND($AC$105>0,$I$138>0),\nIF($C$105<Nutzungsdauer,\nIF(S$161=$AC$105+$C$105,-$I$138*(1+r_invest)^S$160,\nIF(S$161=$AC$105+Nutzungsdauer,$I$138*(1+r_invest)^S$160*($J$138-(Nutzungsdauer-$C$105))/$J$138,0)),0),0)","v":0},0,0,0,0]
[null,"Einsparung CO2-Emissionen",null,{"$f":"IF($AC105>0,\nIF(D$161<$AC105,0,\nIF($AC105=D$161,(13-$AD105)/12,\nIF(($AC105+$C105)>D$161,1,\nIF(($AC105+$C105)=D$161,(($AD105-1)/12+(13-$AD105)/12*$C138),\nIF(($AC105+Nutzungsdauer)>D$161,$C138,\nIF(($AC105+Nutzungsdauer)=D$161,($AD105-1)/12*$C138,\n0)))))),0)\n*($M72*$C$24*(1+$J$24)^D$160)","v":0},0,0,0,0,0,0,0,0,0,0,0,0,0,0,0,0,0,0,0]
[null,{"$f":"$B$170","v":"Nettoersparnis"},{"$f":"SUM(C417:C421)","v":0},0,0,0,0,0,0,0,0,0,0,0,0,0,0,0,0,0,{"$f":"SUM(U417:U421)","v":0},{"$f":"SUM(V417:V421)","v":0},{"$f":"SUM(W417:W421)","v":0}]
[null,"Nettoeinsparung diskontiert (Barwert)",{"$f":"C422","v":0},{"$f":"D422*(1+C$39)^-D$160","v":0},0,0,0,0,0,0,0,0,0,0,0,0,0,0,0,0,0,0,0,null,null,{"$f":"SUM(C423:W423)","v":0}]
[]
[null,{"$f":"B$73","v":"Anbieter 30"}]
[null,{"$f":"$B$165","v":"Einspargarantie Kosten"},null,{"$f":"IF($AC106>0,\nIF(D$161<$AC106,0,\nIF($AC106=D$161,(13-$AD106)/12,\nIF(($AC106+$C106)>D$161,1,\nIF(($AC106+$C106)=D$161,(($AD106-1)/12+(13-$AD106)/12*$C139),\nIF(($AC106+Nutzungsdauer)>D$161,$C139,\nIF(($AC106+Nutzungsdauer)=D$161,($AD106-1)/12*$C139,\n0)))))),0)\n*($J73*(1+$D$24)^D$160+$K73*(1+$E$24)^D$160+$L73*(1+$F$24)^D$160+$N73*(1+$G$24)^D$160+SUM($O73:$Q73))","v":0},0,0,0,0,0,0,0,0,0,0,0,0,0,0,0,0,0,0,0]
[null,{"$f":"$B$166","v":"Einsparung Instandhaltung"},null,{"$f":"IF($AC106>0,\nIF(D$161<$AC106,0,\nIF($AC106=D$161,(13-$AD106)/12,\nIF(($AC106+$C106)>D$161,1,\nIF(($AC106+$C106)=D$161,(($AD106-1)/12),\n0)))),0)\n*($D139*$L106)*(1+$I$24)^D$160","v":0},0,0,0,0,0,0,0,0,0,0,0,0,0,0,0,0,0,0,0]
[null,{"$f":"$B$167","v":"Vergütung Contractor (inkl. Baukostenzuschuss im Jahr 0)"},{"$f":"-$N$106","v":0},{"$f":"IF($AC106>0,\nIF(D$161<$AC106,0,\nIF($AC106=D$161,(13-$AD106)/12,\nIF(($AC106+$C106)>D$161,1,\nIF(($AC106+$C106)=D$161,(($AD106-1)/12),\n0)))),0)\n*-$H106","v":0},0,0,0,0,0,0,0,0,0,0,0,0,0,0,0,0,0,0,0]
[null,{"$f":"$B$168","v":"Ersatzinvestition inkl. deren Restwert am Ende des Betrachtungszeitraums"},null,{"$f":"IF(AND($AC$106>0,$I$139>0),\nIF($C$106<Nutzungsdauer,\nIF(D$161=$AC$106+$C$106,-$I$139*(1+r_invest)^D$160,\nIF(D$161=$AC$106+Nutzungsdauer,$F$106*(1+r_invest)^D$160*($J$139-(Nutzungsdauer-$C$106))/$J$139,0)),0),0)","v":0},0,0,0,0,0,0,0,0,0,0,0,0,0,0,{"$f":"IF(AND($AC$106>0,$I$139>0),\nIF($C$106<Nutzungsdauer,\nIF(S$161=$AC$106+$C$106,-$I$139*(1+r_invest)^S$160,\nIF(S$161=$AC$106+Nutzungsdauer,$I$139*(1+r_invest)^S$160*($J$139-(Nutzungsdauer-$C$106))/$J$139,0)),0),0)","v":0},0,0,0,0]
[null,"Einsparung CO2-Emissionen",null,{"$f":"IF($AC106>0,\nIF(D$161<$AC106,0,\nIF($AC106=D$161,(13-$AD106)/12,\nIF(($AC106+$C106)>D$161,1,\nIF(($AC106+$C106)=D$161,(($AD106-1)/12+(13-$AD106)/12*$C139),\nIF(($AC106+Nutzungsdauer)>D$161,$C139,\nIF(($AC106+Nutzungsdauer)=D$161,($AD106-1)/12*$C139,\n0)))))),0)\n*($M73*$C$24*(1+$J$24)^D$160)","v":0},0,0,0,0,0,0,0,0,0,0,0,0,0,0,0,0,0,0,0]
[null,{"$f":"$B$170","v":"Nettoersparnis"},{"$f":"SUM(C426:C430)","v":0},0,0,0,0,0,0,0,0,0,0,0,0,0,0,0,0,0,{"$f":"SUM(U426:U430)","v":0},{"$f":"SUM(V426:V430)","v":0},{"$f":"SUM(W426:W430)","v":0}]
[null,"Nettoeinsparung diskontiert (Barwert)",{"$f":"C431","v":0},{"$f":"D431*(1+C$39)^-D$160","v":0},0,0,0,0,0,0,0,0,0,0,0,0,0,0,0,0,0,0,0,null,null,{"$f":"SUM(C432:W432)","v":0}]

{"sheet":"Nutzwertanalyse Angebotsvgl.","index":3,"n_rows":50,"n_cols":33,"rows_kept":50,"cut":false,"hidden":false,"merged":[]}
[null,"Link zur Navigationseite"]
[]
[null,"Berechnungshilfe für die Angebotsbewertung und Wirtschaftlichkeitsuntersuchung im Energiespar-Contracting"]
[]
[null,"Nutzwertanalyse"]
[]
[]
["Projekt:",{"$f":"Angebotsvergleich!$B$7","v":"Testprojekt"},null,"Eingabefelder"]
["Datum:",{"$f":"Angebotsvergleich!$B$8","v":"2016-01-01"},null,"Berechnete Werte"]
["Bearbeiter:",{"$f":"Angebotsvergleich!$B$9","v":"Testbearbeiter"},null,"Alle Kostenangaben netto"]
[]
[]
[null,"Eingaben in diesem Blatt:"]
[null,"Gewichtung der Kriterien gemäß Festlegung in den Vergabeunterlagen"]
[null,"Bewertung des Technisch-Organisatorischen Konzepts"]
[]
[null,"Für das Kriterium \"Technisch-Organisatorisches Konzept\" bietet sich eine Bewertung nach folgender Tabelle an:"]
[null,"0 Punkte","ungenügend, grobe Mängel, Maßnahmen nicht umsetzbar, nicht passend zur vorhandenen Anlagentechnik/ zum Objekt "]
[null,"30 Punkte","ausreichend, mit größeren Mängeln, Maßnahmen schwer umsetzbar"]
[null,"50 Punkte","befriedigend, mit kleineren Mängeln, Maßnahmenkonzept überwiegend plausibel und umsetzbar"]
[null,"80 Punkte","gut, plausibles und umsetzbares Maßnahmenkonzept, passend zur Liegenschaft"]
[null,"100 Punkte","sehr gut, plausibles und umsetzbares Maßnahmenkonzept, Anforderungen und Vorstellungen des AG werden voll- bzw. übererfüllt"]
[]
[null,"Verwendete Formeln zur Kriterienerfüllung"]
["1.","Für Kriterien, bei denen hohe Werte zu einer günstigeren Bewertung führen \n(z.B. Kapitalwert, Technisch-organisatorisches Konzept)"]
[null,"Punkteanzahl = 100 x Bieterwert / Maximalwert"]
["2.","Für Kriterien, bei denen niedrige Werte zu einer günstigeren Bewertung führen (z.B. Forfaitierungsanteil)"]
[null,"Punkteanzahl = 100 - 100 x Bieterwert / Maximalwert"]
[]
[null,null,"Gewichtung"]
[null,"Bewertungskriterien","[%]",{"$f":"Angebotsvergleich!B44","v":"Anbieter 1"},{"$f":"Angebotsvergleich!B45","v":"Anbieter 2"},{"$f":"Angebotsvergleich!B46","v":"Anbieter 3"},{"$f":"Angebotsvergleich!B47","v":"Anbieter 4"},{"$f":"Angebotsvergleich!B48","v":"Anbieter 5"},{"$f":"Angebotsvergleich!B49","v":"Anbieter 6"},{"$f":"Angebotsvergleich!B50","v":"Anbieter 7"},{"$f":"Angebotsvergleich!B51","v":"Anbieter 8"},{"$f":"Angebotsvergleich!B52","v":"Anbieter 9"},{"$f":"Angebotsvergleich!B53","v":"Anbieter 10"},{"$f":"Angebotsvergleich!B54","v":"Anbieter 11"},{"$f":"Angebotsvergleich!B55","v":"Anbieter 12"},{"$f":"Angebotsvergleich!B56","v":"Anbieter 13"},{"$f":"Angebotsvergleich!B57","v":"Anbieter 14"},{"$f":"Angebotsvergleich!B58","v":"Anbieter 15"},{"$f":"Angebotsvergleich!B59","v":"Anbieter 16"},{"$f":"Angebotsvergleich!$B60","v":"Anbieter 17"},{"$f":"Angebotsvergleich!$B61","v":"Anbieter 18"},{"$f":"Angebotsvergleich!$B62","v":"Anbieter 19"},{"$f":"Angebotsvergleich!$B63","v":"Anbieter 20"},{"$f":"Angebotsvergleich!$B64","v":"Anbieter 21"},{"$f":"Angebotsvergleich!$B65","v":"Anbieter 22"},{"$f":"Angebotsvergleich!$B66","v":"Anbieter 23"},{"$f":"Angebotsvergleich!$B67","v":"Anbieter 24"},{"$f":"Angebotsvergleich!$B68","v":"Anbieter 25"},{"$f":"Angebotsvergleich!$B69","v":"Anbieter 26"},{"$f":"Angebotsvergleich!$B70","v":"Anbieter 27"},{"$f":"Angebotsvergleich!$B71","v":"Anbieter 28"},{"$f":"Angebotsvergleich!$B72","v":"Anbieter 29"},{"$f":"Angebotsvergleich!$B73","v":"Anbieter 30"}]
[null,"Kapitalwert",null,{"$f":"IF(Angebotsvergleich!Z171<>\"\",Angebotsvergleich!Z171)","v":0},{"$f":"IF(Angebotsvergleich!Z180<>\"\",Angebotsvergleich!Z180)","v":0},{"$f":"IF(Angebotsvergleich!Z189<>\"\",Angebotsvergleich!Z189)","v":0},{"$f":"IF(Angebotsvergleich!Z198<>\"\",Angebotsvergleich!Z198)","v":0},{"$f":"IF(Angebotsvergleich!Z207<>\"\",Angebotsvergleich!Z207)","v":0},{"$f":"IF(Angebotsvergleich!Z216<>\"\",Angebotsvergleich!Z216)","v":0},{"$f":"IF(Angebotsvergleich!Z225<>\"\",Angebotsvergleich!Z225)","v":0},{"$f":"IF(Angebotsvergleich!Z234<>\"\",Angebotsvergleich!Z234)","v":0},{"$f":"IF(Angebotsvergleich!Z243<>\"\",Angebotsvergleich!Z243)","v":0},{"$f":"IF(Angebotsvergleich!Z252<>\"\",Angebotsvergleich!Z252)","v":0},{"$f":"IF(Angebotsvergleich!Z261<>\"\",Angebotsvergleich!Z261)","v":0},{"$f":"IF(Angebotsvergleich!Z270<>\"\",Angebotsvergleich!Z270)","v":0},{"$f":"IF(Angebotsvergleich!Z279<>\"\",Angebotsvergleich!Z279)","v":0},{"$f":"IF(Angebotsvergleich!Z288<>\"\",Angebotsvergleich!Z288)","v":0},{"$f":"IF(Angebotsvergleich!Z297<>\"\",Angebotsvergleich!Z297)","v":0},{"$f":"IF(Angebotsvergleich!Z306<>\"\",Angebotsvergleich!Z306)","v":0},{"$f":"IF(Angebotsvergleich!$Z315<>\"\",Angebotsvergleich!$Z315)","v":0},{"$f":"IF(Angebotsvergleich!$Z324<>\"\",Angebotsvergleich!$Z324)","v":0},{"$f":"IF(Angebotsvergleich!$Z333<>\"\",Angebotsvergleich!$Z333)","v":0},{"$f":"IF(Angebotsvergleich!$Z342<>\"\",Angebotsvergleich!$Z342)","v":0},{"$f":"IF(Angebotsvergleich!$Z351<>\"\",Angebotsvergleich!$Z351)","v":0},{"$f":"IF(Angebotsvergleich!$Z360<>\"\",Angebotsvergleich!$Z360)","v":0},{"$f":"IF(Angebotsvergleich!$Z369<>\"\",Angebotsvergleich!$Z369)","v":0},{"$f":"IF(Angebotsvergleich!$Z378<>\"\",Angebotsvergleich!$Z378)","v":0},{"$f":"IF(Angebotsvergleich!$Z387<>\"\",Angebotsvergleich!$Z387)","v":0},{"$f":"IF(Angebotsvergleich!$Z396<>\"\",Angebotsvergleich!$Z396)","v":0},{"$f":"IF(Angebotsvergleich!$Z405<>\"\",Angebotsvergleich!$Z405)","v":0},{"$f":"IF(Angebotsvergleich!$Z414<>\"\",Angebotsvergleich!$Z414)","v":0},{"$f":"IF(Angebotsvergleich!$Z423<>\"\",Angebotsvergleich!$Z423)","v":0},{"$f":"IF(Angebotsvergleich!$Z432<>\"\",Angebotsvergleich!$Z432)","v":0}]
[null,"Forfaitierter Betrag in Vertragslaufzeit\n[€] (Risikoarmes Finanzierungskonzept)",null,{"$f":"Angebotsvergleich!$R$77","v":""},{"$f":"Angebotsvergleich!$R$78","v":""},{"$f":"Angebotsvergleich!$R$79","v":""},{"$f":"Angebotsvergleich!$R$80","v":""},{"$f":"Angebotsvergleich!$R$81","v":""},{"$f":"Angebotsvergleich!$R$82","v":""},{"$f":"Angebotsvergleich!$R$83","v":""},{"$f":"Angebotsvergleich!$R$84","v":""},{"$f":"Angebotsvergleich!$R$85","v":""},{"$f":"Angebotsvergleich!$R$86","v":""},{"$f":"Angebotsvergleich!$R$87","v":""},{"$f":"Angebotsvergleich!$R$88","v":""},{"$f":"Angebotsvergleich!$R$89","v":""},{"$f":"Angebotsvergleich!$R$90","v":""},{"$f":"Angebotsvergleich!$R$91","v":""},{"$f":"Angebotsvergleich!$R$92","v":""},{"$f":"Angebotsvergleich!$R$93","v":""},{"$f":"Angebotsvergleich!$R$94","v":""},{"$f":"Angebotsvergleich!$R$95","v":""},{"$f":"Angebotsvergleich!$R$96","v":""},{"$f":"Angebotsvergleich!$R$97","v":""},{"$f":"Angebotsvergleich!$R$98","v":""},{"$f":"Angebotsvergleich!$R$99","v":""},{"$f":"Angebotsvergleich!$R$100","v":""},{"$f":"Angebotsvergleich!$R$101","v":""},{"$f":"Angebotsvergleich!$R$102","v":""},{"$f":"Angebotsvergleich!$R$103","v":""},{"$f":"Angebotsvergleich!$R$104","v":""},{"$f":"Angebotsvergleich!$R$105","v":""},{"$f":"Angebotsvergleich!$R$106","v":""}]
[null,"Technisch-organisatorisches Konzept"]
[null,null,{"$f":"SUM(C32:C34)","v":0}]
[]
[null,"Kriterienerfüllung","verwendete Formel"]
[null,{"$f":"B32","v":"Kapitalwert"},"1.",{"$f":"IF(D32<>\"\",100*D32/MAX($D32:$AG32),\"\")","v":{"$error":"#DIV/0!"}},{"$error":"#DIV/0!"},{"$error":"#DIV/0!"},{"$error":"#DIV/0!"},{"$error":"#DIV/0!"},{"$error":"#DIV/0!"},{"$error":"#DIV/0!"},{"$error":"#DIV/0!"},{"$error":"#DIV/0!"},{"$error":"#DIV/0!"},{"$error":"#DIV/0!"},{"$error":"#DIV/0!"},{"$error":"#DIV/0!"},{"$error":"#DIV/0!"},{"$error":"#DIV/0!"},{"$error":"#DIV/0!"},{"$error":"#DIV/0!"},{"$error":"#DIV/0!"},{"$error":"#DIV/0!"},{"$error":"#DIV/0!"},{"$error":"#DIV/0!"},{"$error":"#DIV/0!"},{"$error":"#DIV/0!"},{"$error":"#DIV/0!"},{"$error":"#DIV/0!"},{"$error":"#DIV/0!"},{"$error":"#DIV/0!"},{"$error":"#DIV/0!"},{"$error":"#DIV/0!"},{"$error":"#DIV/0!"}]
[null,{"$f":"B33","v":"Forfaitierter Betrag in Vertragslaufzeit\n[€] (Risikoarmes Finanzierungskonzept)"},"2.",{"$f":"IF(MAX($D33:$AG33)>0,(IF(D33<>\"\",100-100*D33/MAX($D33:$AG33),\"\")),100)","v":100},{"$f":"IF(MAX($D33:$AG33)>0,(IF(E33<>\"\",100-100*E33/MAX($D33:$AG33),\"\")),100)","v":100},100,100,100,100,100,100,100,100,100,100,100,100,100,100,100,100,100,100,100,100,100,100,100,100,100,100,100,100]
[null,{"$f":"B34","v":"Technisch-organisatorisches Konzept"},"1.",{"$f":"IF(D34<>\"\",100*D34/MAX($D34:$AG34),\"\")","v":""},"","","","","","","","","","","","","","","","","","","","","","","","","","","","",""]
[]
[null,"Teilnutzen"]
[null,{"$f":"B32","v":"Kapitalwert"},null,{"$f":"IF(D38<>\"\",D38*$C32,\"\")","v":{"$error":"#DIV/0!"}},{"$error":"#DIV/0!"},{"$error":"#DIV/0!"},{"$error":"#DIV/0!"},{"$error":"#DIV/0!"},{"$error":"#DIV/0!"},{"$error":"#DIV/0!"},{"$error":"#DIV/0!"},{"$error":"#DIV/0!"},{"$error":"#DIV/0!"},{"$error":"#DIV/0!"},{"$error":"#DIV/0!"},{"$error":"#DIV/0!"},{"$error":"#DIV/0!"},{"$error":"#DIV/0!"},{"$error":"#DIV/0!"},{"$error":"#DIV/0!"},{"$error":"#DIV/0!"},{"$error":"#DIV/0!"},{"$error":"#DIV/0!"},{"$error":"#DIV/0!"},{"$error":"#DIV/0!"},{"$error":"#DIV/0!"},{"$error":"#DIV/0!"},{"$error":"#DIV/0!"},{"$error":"#DIV/0!"},{"$error":"#DIV/0!"},{"$error":"#DIV/0!"},{"$error":"#DIV/0!"},{"$error":"#DIV/0!"}]
[null,{"$f":"B33","v":"Forfaitierter Betrag in Vertragslaufzeit\n[€] (Risikoarmes Finanzierungskonzept)"},null,{"$f":"IF(D39<>\"\",D39*$C33,\"\")","v":0},0,0,0,0,0,0,0,0,0,0,0,0,0,0,0,0,0,0,0,0,0,0,0,0,0,0,0,0,0]
[null,{"$f":"B34","v":"Technisch-organisatorisches Konzept"},null,{"$f":"IF(D40<>\"\",D40*$C34,\"\")","v":""},"","","","","","","","","","","","","","","","","","","","","","","","","","","","",""]
[]
[null,"Nutzwert",null,{"$f":"D31","v":"Anbieter 1"},"Anbieter 2","Anbieter 3","Anbieter 4","Anbieter 5","Anbieter 6","Anbieter 7","Anbieter 8","Anbieter 9","Anbieter 10","Anbieter 11","Anbieter 12","Anbieter 13","Anbieter 14","Anbieter 15","Anbieter 16","Anbieter 17","Anbieter 18","Anbieter 19","Anbieter 20","Anbieter 21","Anbieter 22","Anbieter 23","Anbieter 24","Anbieter 25","Anbieter 26","Anbieter 27","Anbieter 28","Anbieter 29","Anbieter 30"]
[null,"Summe",null,{"$f":"SUM(D43:D45)","v":{"$error":"#DIV/0!"}},{"$error":"#DIV/0!"},{"$error":"#DIV/0!"},{"$error":"#DIV/0!"},{"$error":"#DIV/0!"},{"$error":"#DIV/0!"},{"$error":"#DIV/0!"},{"$error":"#DIV/0!"},{"$error":"#DIV/0!"},{"$error":"#DIV/0!"},{"$error":"#DIV/0!"},{"$error":"#DIV/0!"},{"$error":"#DIV/0!"},{"$error":"#DIV/0!"},{"$error":"#DIV/0!"},{"$error":"#DIV/0!"},{"$error":"#DIV/0!"},{"$error":"#DIV/0!"},{"$error":"#DIV/0!"},{"$error":"#DIV/0!"},{"$error":"#DIV/0!"},{"$error":"#DIV/0!"},{"$error":"#DIV/0!"},{"$error":"#DIV/0!"},{"$error":"#DIV/0!"},{"$error":"#DIV/0!"},{"$error":"#DIV/0!"},{"$error":"#DIV/0!"},{"$error":"#DIV/0!"},{"$error":"#DIV/0!"}]
[null,"Rang",null,{"$f":"IF(D48>0,RANK(D48,$D$48:$AG$48),\"\")","v":{"$error":"#DIV/0!"}},{"$f":"IF(E48>0,RANK(E48,$D$48:$AG$48),\"\")","v":{"$error":"#DIV/0!"}},{"$error":"#DIV/0!"},{"$error":"#DIV/0!"},{"$error":"#DIV/0!"},{"$error":"#DIV/0!"},{"$error":"#DIV/0!"},{"$error":"#DIV/0!"},{"$error":"#DIV/0!"},{"$error":"#DIV/0!"},{"$error":"#DIV/0!"},{"$error":"#DIV/0!"},{"$error":"#DIV/0!"},{"$error":"#DIV/0!"},{"$error":"#DIV/0!"},{"$error":"#DIV/0!"},{"$error":"#DIV/0!"},{"$error":"#DIV/0!"},{"$error":"#DIV/0!"},{"$error":"#DIV/0!"},{"$error":"#DIV/0!"},{"$error":"#DIV/0!"},{"$error":"#DIV/0!"},{"$error":"#DIV/0!"},{"$error":"#DIV/0!"},{"$error":"#DIV/0!"},{"$error":"#DIV/0!"},{"$error":"#DIV/0!"},{"$error":"#DIV/0!"},{"$error":"#DIV/0!"}]
[null,null,null,"Summe Punkte max. 100"]

{"sheet":"Eigenbau","index":4,"n_rows":70,"n_cols":25,"rows_kept":70,"cut":false,"hidden":false,"merged":[]}
[null,"Link zur Navigationseite"]
[]
[null,"Berechnungshilfe für die Angebotsbewertung und Wirtschaftlichkeitsuntersuchung im Energiespar-Contracting"]
[]
[null,"Wirtschaftlichkeitsvergleich"]
[null,{"$f":"\"Contracting-Anbieter \"&INDEX(Angebotsvergleich!B44:B60,Eigenbau!$C$21)&\" vs. Eigenbaumaßnahme\"","v":"Contracting-Anbieter Anbieter 1 vs. Eigenbaumaßnahme"}]
[]
["Projekt:",{"$f":"Angebotsvergleich!$B$7","v":"Testprojekt"},null,"Eingabefelder"]
["Datum:",{"$f":"Angebotsvergleich!$B$8","v":"2016-01-01"},null,"Eingabefelder/ Vorschlag Berechnungswerte"]
["Bearbeiter:",{"$f":"Angebotsvergleich!$B$9","v":"Testbearbeiter"},null,"Berechnete Werte"]
[null,null,null,"Alle Kostenangaben netto"]
[]
[null,"Eingaben in diesem Blatt:"]
[null,"Auswahl Contracting-Anbiete für Vergleich mit Eigenbaumaßnahmen"]
[null,"Tabelle 5: Parameter für Eigenbaumaßnahme"]
[]
[]
[null,null,"Auswahl für Vergleich mit Eigenbaumaßnahme"]
[null,null,"Contracting-"]
[null,null,"Anbieter Nr."]
[null,null,1]
[]
[]
[null,null,"Tabelle 1: Berechnungsgrundlagen"]
[null,null,"Nutzungsdauer\nEnergiespar-\nmaßnahmen\n[a]","Referenzpreis\nCO2-Emissionen\n[€/t CO2]","Jährliche Preissteigerungsrate\nArbeit Elektroenergie\n[%]","Jährliche Preissteigerungsrate\nArbeit Heizenergie\n[%]","Jährliche Preissteigerungsrate\nWasser/Abwasser\n[%]","Jährliche Preissteigerungsrate\nsonstige jährl. Kosten\n[%]","Jährliche Preissteigerungsrate\nInvestitionsgüter\n[%]","Jährliche Preissteigerungsrate Betriebsführungs-kosten\n[%]","Jährliche Preissteigerungsrate\nCO2-Emissionen\n[%]"]
[null,null,{"$f":"Angebotsvergleich!B24","v":15},{"$f":"Angebotsvergleich!C24","v":80},{"$f":"r_strom","v":0},{"$f":"r_heiz","v":0},{"$f":"r_wasser","v":0},{"$f":"r_sonst","v":0},{"$f":"r_invest","v":0},{"$f":"r_betrieb","v":0},{"$f":"Angebotsvergleich!J24","v":0}]
[]
[null,null,{"$f":"Angebotsvergleich!B31","v":"Tabelle 2: Zinssätze für die Wirtschaftlichkeitsberechnung"}]
[null,null,{"$f":"Angebotsvergleich!B38","v":"Jahr"},{"$f":"Angebotsvergleich!C38","v":1},{"$f":"Angebotsvergleich!D38","v":2},{"$f":"Angebotsvergleich!E38","v":3},{"$f":"Angebotsvergleich!F38","v":4},{"$f":"Angebotsvergleich!G38","v":5},{"$f":"Angebotsvergleich!H38","v":6},{"$f":"Angebotsvergleich!I38","v":7},{"$f":"Angebotsvergleich!J38","v":8},{"$f":"Angebotsvergleich!K38","v":9},{"$f":"Angebotsvergleich!L38","v":10},{"$f":"Angebotsvergleich!M38","v":11},{"$f":"Angebotsvergleich!N38","v":12},{"$f":"Angebotsvergleich!O38","v":13},{"$f":"Angebotsvergleich!P38","v":14},{"$f":"Angebotsvergleich!Q38","v":15},16,17,18,19,20]
[null,null,{"$f":"Angebotsvergleich!B39","v":"Zinssatz"},{"$f":"Angebotsvergleich!C39","v":0},{"$f":"Angebotsvergleich!D39","v":0},{"$f":"Angebotsvergleich!E39","v":0},{"$f":"Angebotsvergleich!F39","v":0},{"$f":"Angebotsvergleich!G39","v":0},{"$f":"Angebotsvergleich!H39","v":0},{"$f":"Angebotsvergleich!I39","v":0},{"$f":"Angebotsvergleich!J39","v":0},{"$f":"Angebotsvergleich!K39","v":0},{"$f":"Angebotsvergleich!L39","v":0},{"$f":"Angebotsvergleich!M39","v":0},{"$f":"Angebotsvergleich!N39","v":0},{"$f":"Angebotsvergleich!O39","v":0},{"$f":"Angebotsvergleich!P39","v":0},{"$f":"Angebotsvergleich!Q39","v":0},{"$f":"Angebotsvergleich!R39","v":0},{"$f":"Angebotsvergleich!S39","v":0},{"$f":"Angebotsvergleich!T39","v":0},{"$f":"Angebotsvergleich!U39","v":0},{"$f":"Angebotsvergleich!V39","v":0}]
[]
[null,null,{"$f":"\"Tabelle 3: Einspargarantie (Angebot Grobanalyse) \"&INDEX(Angebotsvergleich!B44:B73,Eigenbau!$C$21)","v":"Tabelle 3: Einspargarantie (Angebot Grobanalyse) Anbieter 1"}]
[null,null,"Einsparung\nKosten\nElektroenergie\nNT [Euro/a]","Einsparung\nKosten \nElektroenergie\nHT [Euro/a]","Einsparung\nKosten \nLeistungsreduzierung\nElektroenergie\n[Euro/a]","Einsparung\nKosten der \nHeizenergie\n[Euro/a]","Einsparung \nKosten der\nLeistungsreduzierung\nHeizung\n[Euro/a]","Einsparung\nWasser\n[Euro/a]","Einsparung\nAbwasser\n[Euro/a]","Einspargarantie\nElektroenergie-Kosten\n[Euro/a]","Einspargarantie\nWärmeenergie-Kosten\n[Euro/a]","Einspargarantie\nWasser/Abwasser-Kosten\n[Euro/a]","Einsparung\nCO2-Emissionen\n[t CO2/a]","Einspargarantie\nsonstige jährliche Kosten\n[Euro/a]","Garantierte\nSteuerrückerstattung\n[Euro/a]","Garantierte\nEEG Vergütung\n[Euro/a]","Garantierte\nKWK Vergütung\n[Euro/a]","Einspargarantie\nSumme der Kosten (im 0. Jahr)\n[Euro/a]"]
[null,null,{"$f":"INDEX(Angebotsvergleich!C44:C73,Eigenbau!$C$21)","v":0},{"$f":"INDEX(Angebotsvergleich!D44:D73,Eigenbau!$C$21)","v":0},{"$f":"INDEX(Angebotsvergleich!E44:E73,Eigenbau!$C$21)","v":0},{"$f":"INDEX(Angebotsvergleich!F44:F73,Eigenbau!$C$21)","v":0},{"$f":"INDEX(Angebotsvergleich!G44:G73,Eigenbau!$C$21)","v":0},{"$f":"INDEX(Angebotsvergleich!H44:H73,Eigenbau!$C$21)","v":0},{"$f":"INDEX(Angebotsvergleich!I44:I73,Eigenbau!$C$21)","v":0},{"$f":"C34+D34+E34","v":0},{"$f":"F34+G34","v":0},{"$f":"H34+I34","v":0},{"$f":"INDEX(Angebotsvergleich!M44:M73,Eigenbau!$C$21)","v":0},{"$f":"INDEX(Angebotsvergleich!N44:N73,Eigenbau!$C$21)","v":0},{"$f":"INDEX(Angebotsvergleich!O44:O73,Eigenbau!$C$21)","v":0},{"$f":"INDEX(Angebotsvergleich!P44:P73,Eigenbau!$C$21)","v":0},{"$f":"INDEX(Angebotsvergleich!Q44:Q73,Eigenbau!$C$21)","v":0},{"$f":"SUM(J34:L34)+SUM(N34:Q34)","v":0}]
[]
[null,null,{"$f":"\"Tabelle 4: Angebotskonditionen (Grobanalyse) \"&INDEX(Angebotsvergleich!B44:B73,Eigenbau!$C$21)","v":"Tabelle 4: Angebotskonditionen (Grobanalyse) Anbieter 1"}]
[null,null,"Dauer\nGarantiephase\n[a]","Garantierte\nEnergiekosten-\neinsparung\n[Euro/a]","Beteiligung\nAuftragnehmer an \nGarantieeinsparung\n[%]","Grundvergütung\nAuftragnehmer\n[Euro]","Jährl. Finanzierungsbeitrag\nAuftraggeber \n[Euro]","Jährl. Vergütung\nAuftragnehmer\n[Euro]","Beteiligung\nAuftraggeber an \nzusätzl. Einsparung\n[%]","Investitionen in \ntechnische Geräte, Anlagen und Sachen\n[Euro]","Projektierungskosten\nFeinanalyse\n[Euro]","Einmaliger Baukostenzuschuss des Auftraggebers\n[Euro]","Beginn \nGarantiephase\n[MM/JJJJ]",null,null,null,"Hilfszellen zur Berechnung","Hilfszellen zur Berechnung"]
[null,null,{"$f":"INDEX(Angebotsvergleich!C77:C106,Eigenbau!$C$21)","v":0},{"$f":"R34","v":0},{"$f":"INDEX(Angebotsvergleich!E77:E106,Eigenbau!$C$21)","v":0},{"$f":"INDEX(Angebotsvergleich!F77:F106,Eigenbau!$C$21)","v":0},{"$f":"INDEX(Angebotsvergleich!G77:G106,Eigenbau!$C$21)","v":0},{"$f":"F38+G38","v":0},{"$f":"INDEX(Angebotsvergleich!J77:J106,Eigenbau!$C$21)","v":0},{"$f":"INDEX(Angebotsvergleich!L77:L106,Eigenbau!$C$21)","v":0},{"$f":"INDEX(Angebotsvergleich!M77:M106,Eigenbau!$C$21)","v":0},{"$f":"INDEX(Angebotsvergleich!N77:N106,Eigenbau!$C$21)","v":0},{"$f":"INDEX(Angebotsvergleich!O77:O106,Eigenbau!$C$21)","v":"00:00:00"},null,null,null,{"$f":"IF(AND(YEAR($M38)>2010,YEAR($M38)<2099),YEAR($M38),0)","v":0},{"$f":"MONTH($M38)","v":1}]
[]
[null,null,"Tabelle 5: Eigenbaumaßnahmen"]
[null,null,"Investitionen in \ntechnische Geräte, Anlagen und Sachen [Euro]","Risikoaufschlag auf Investitionen in \ntechnische Geräte, Anlagen und Sachen\nin %","Risikoaufschlag auf Investitionen in \ntechnische Geräte, Anlagen und Sachen\n[Euro]","Investitionen in \ntechnische Geräte, Anlagen und Sachen inkl. Risikoaufschlag\n[Euro]","Honorarsatz\nPlanung bezogen\nauf Baukosten\nin %","Planungskosten\n[Euro]","Beginn Einsparung\nnach Planungs-\nund Bauzeit\n[MM/JJJJ]","Investitionskosten Eigenbau [Euro]","Einsparprognose\nEigenbau zur \ngarant. Einsparung\ninkl. Risikoabschlag\n[%]","Instandhaltungs-\nkosten inkl. Risikozuschlag bezogen auf\nBaukosten\n[%]",null,null,null,null,null,"Hilfszellen zur Berechnung","Hilfszellen zur Berechnung"]
[null,null,{"$f":"J38","v":0},0.1,{"$f":"C42*D42","v":0},{"$f":"C42+E42","v":0},null,{"$f":"F42*G42","v":0},{"$f":"IF(M38>0,M38,1)","v":"1900-01-01"},{"$f":"F42+H42","v":0},{"$f":"INDEX(Angebotsvergleich!C110:C139,Eigenbau!$C$21)","v":0},{"$f":"INDEX(Angebotsvergleich!D110:D139,Eigenbau!$C$21)","v":0},null,null,null,null,null,{"$f":"IF(AND(YEAR($I42)>2010,YEAR($I42)<2099),YEAR($I42),0)","v":0},{"$f":"MONTH($I42)","v":1}]
[null,null,"Dieser Wert entspricht den Investitionen des ausgewählten Contracting-Angebot. Bitte passen Sie den berechneten Wert manuell an, falls eigene Ansätze für  Investitionsermittlung  verfügbar sind.","Pauschaler Aufschlag für die Risikoübernahme des Contractor für die Einhaltung des Investitionsbudgets. Manuell anpassen, sofern geeignete Werte vorliegen.",null,null,null,"Berechneten Wert manuell anpassen, falls eigene Ansätze für Planungskosten vefügbar sind.","Beginn Einsparung Eigenbau = Beginn Garantiephase aus Contracting-Angebot (voreingestellt); \nWert kann manuell angepasst werden!",null,"siehe Angebotsvergleich, Tabelle 5","siehe Angebotsvergleich, Tabelle 5"]
[]
[null,null,"Tabelle 6: Ersatzinvestition"]
[null,null,"Investition des AG nach Vertragsende zur Aufrechterhaltung der Einsparung\n[€]","Nutzungsdauer der Ersatzinvestition \n[a]","siehe Angebotsvergleich, Tabelle 6"]
[null,null,{"$f":"INDEX(Angebotsvergleich!I110:I139,Eigenbau!$C$21)","v":0},{"$f":"INDEX(Angebotsvergleich!J110:J139,Eigenbau!$C$21)","v":0}]
[]
[null,"Vergleich"]
[null,"Jahr 0 =",{"$f":"Angebotsvergleich!C159","v":-1}]
[null,"lfd. Jahr",0,1,2,3,4,5,6,7,8,9,10,11,12,13,14,15,16,17,18,19,20]
[null,"Jahr",{"$f":"C50","v":-1},{"$f":"C52+1","v":0},{"$f":"D52+1","v":1},{"$f":"E52+1","v":2},3,4,5,6,7,8,9,10,11,12,13,14,15,16,17,{"$f":"U52+1","v":18},{"$f":"V52+1","v":19}]
[null,"Erläuterung:","0. Jahr = im Jahr 0 erfolgt keine Diskontierung. Einziger Zahlungsstrom ist der Baukostenzuschuss.","1. Jahr = Beginn der Vorbereitungsphase. Die Garantiephase beginnt zeitlich versetzt entsprechend der Länge der Vorbereitungsphase. Die Energiekosten-einsparung wird im 1. Jahr nur anteilig berechnet."]
[]
[null,"Contracting"]
[null,"Einspargarantie Kosten",null,{"$f":"IF($Q38>0,\nIF(D$52<$Q38,0,\nIF($Q38=D$52,(13-$R38)/12,\nIF(($Q38+$C38)>D$52,1,\nIF(($Q38+$C38)=D$52,(($R38-1)/12+(13-$R38)/12*r_eigenbau),\nIF(($Q38+Nutzungsdauer)>D$52,r_eigenbau,\nIF(($Q38+Nutzungsdauer)=D$52,($R38-1)/12*r_eigenbau,\n0)))))),0)\n*($J$34*(1+$E$26)^D$51+$K$34*(1+$F$26)^D$51+$L$34*(1+$G$26)^D$51+$N$34*(1+$H$26)^D$51+SUM($O$34:$Q$34))","v":0},0,0,0,0,0,0,0,0,0,0,0,0,0,0,0,0,{"$f":"IF($Q38>0,\nIF(U$52<$Q38,0,\nIF($Q38=U$52,(13-$R38)/12,\nIF(($Q38+$C38)>U$52,1,\nIF(($Q38+$C38)=U$52,(($R38-1)/12+(13-$R38)/12*r_eigenbau),\nIF(($Q38+Nutzungsdauer)>U$52,r_eigenbau,\nIF(($Q38+Nutzungsdauer)=U$52,($R38-1)/12*r_eigenbau,\n0)))))),0)\n*($J$34*(1+$E$26)^U$51+$K$34*(1+$F$26)^U$51+$L$34*(1+$G$26)^U$51+$N$34*(1+$H$26)^U$51+SUM($O$34:$Q$34))","v":0},{"$f":"IF($Q38>0,\nIF(V$52<$Q38,0,\nIF($Q38=V$52,(13-$R38)/12,\nIF(($Q38+$C38)>V$52,1,\nIF(($Q38+$C38)=V$52,(($R38-1)/12+(13-$R38)/12*r_eigenbau),\nIF(($Q38+Nutzungsdauer)>V$52,r_eigenbau,\nIF(($Q38+Nutzungsdauer)=V$52,($R38-1)/12*r_eigenbau,\n0)))))),0)\n*($J$34*(1+$E$26)^V$51+$K$34*(1+$F$26)^V$51+$L$34*(1+$G$26)^V$51+$N$34*(1+$H$26)^V$51+SUM($O$34:$Q$34))","v":0},{"$f":"IF($Q38>0,\nIF(W$52<$Q38,0,\nIF($Q38=W$52,(13-$R38)/12,\nIF(($Q38+$C38)>W$52,1,\nIF(($Q38+$C38)=W$52,(($R38-1)/12+(13-$R38)/12*r_eigenbau),\nIF(($Q38+Nutzungsdauer)>W$52,r_eigenbau,\nIF(($Q38+Nutzungsdauer)=W$52,($R38-1)/12*r_eigenbau,\n0)))))),0)\n*($J$34*(1+$E$26)^W$51+$K$34*(1+$F$26)^W$51+$L$34*(1+$G$26)^W$51+$N$34*(1+$H$26)^W$51+SUM($O$34:$Q$34))","v":0}]
[null,"Vergütung Contractor (inkl. Baukostenzuschuss im Jahr 0)",{"$f":"-$L$38","v":0},{"$f":"IF($Q38>0,\nIF(D$52<$Q38,0,\nIF($Q38=D$52,(13-$R38)/12,\nIF(($Q38+$C38)>D$52,1,\nIF(($Q38+$C38)=D$52,(($R38-1)/12),\n0)))),0)\n*-$H$38","v":0},0,0,0,0,0,0,0,0,0,0,0,0,0,0,0,0,{"$f":"IF($Q38>0,\nIF(U$52<$Q38,0,\nIF($Q38=U$52,(13-$R38)/12,\nIF(($Q38+$C38)>U$52,1,\nIF(($Q38+$C38)=U$52,(($R38-1)/12),\n0)))),0)\n*-$H$38","v":0},{"$f":"IF($Q38>0,\nIF(V$52<$Q38,0,\nIF($Q38=V$52,(13-$R38)/12,\nIF(($Q38+$C38)>V$52,1,\nIF(($Q38+$C38)=V$52,(($R38-1)/12),\n0)))),0)\n*-$H$38","v":0},{"$f":"IF($Q38>0,\nIF(W$52<$Q38,0,\nIF($Q38=W$52,(13-$R38)/12,\nIF(($Q38+$C38)>W$52,1,\nIF(($Q38+$C38)=W$52,(($R38-1)/12),\n0)))),0)\n*-$H$38","v":0}]
[null,"Ersatzinvestition inkl. deren Restwert am Ende des Betrachtungszeitraums",null,{"$f":"IF(AND($R$42>0,$C$47>0),\nIF($C$38<Nutzungsdauer,\nIF(D$52=$R$42+$C$38,-$C$47*(1+r_invest)^D$51,\nIF(D$52=$R$42+Nutzungsdauer,$C$47*(1+r_invest)^D$51*($D$47-(Nutzungsdauer-$C$38))/$D$47,0)),0),0)","v":0},0,0,0,0,0,0,0,0,0,0,0,0,0,0,0,0,0,0,0]
[null,"Einsparung CO2-Emissionen",null,{"$f":"IF($Q38>0,\nIF(D$52<$Q38,0,\nIF($Q38=D$52,(13-$R38)/12,\nIF(($Q38+$C38)>D$52,1,\nIF(($Q38+$C38)=D$52,(($R38-1)/12+(13-$R38)/12*r_eigenbau),\nIF(($Q38+Nutzungsdauer)>D$52,r_eigenbau,\nIF(($Q38+Nutzungsdauer)=D$52,($R38-1)/12*r_eigenbau,\n0)))))),0)\n*$M$34*$D$26*(1+$K$26)^D$51","v":0},0,0,0,0,0,0,0,0,0,0,0,0,0,0,0,0,{"$f":"IF($Q38>0,\nIF(U$52<$Q38,0,\nIF($Q38=U$52,(13-$R38)/12,\nIF(($Q38+$C38)>U$52,1,\nIF(($Q38+$C38)=U$52,(($R38-1)/12+(13-$R38)/12*r_eigenbau),\nIF(($Q38+Nutzungsdauer)>U$52,r_eigenbau,\nIF(($Q38+Nutzungsdauer)=U$52,($R38-1)/12*r_eigenbau,\n0)))))),0)\n*$M$34*$D$26*(1+$K$26)^U$51","v":0},{"$f":"IF($Q38>0,\nIF(V$52<$Q38,0,\nIF($Q38=V$52,(13-$R38)/12,\nIF(($Q38+$C38)>V$52,1,\nIF(($Q38+$C38)=V$52,(($R38-1)/12+(13-$R38)/12*r_eigenbau),\nIF(($Q38+Nutzungsdauer)>V$52,r_eigenbau,\nIF(($Q38+Nutzungsdauer)=V$52,($R38-1)/12*r_eigenbau,\n0)))))),0)\n*$M$34*$D$26*(1+$K$26)^V$51","v":0},{"$f":"IF($Q38>0,\nIF(W$52<$Q38,0,\nIF($Q38=W$52,(13-$R38)/12,\nIF(($Q38+$C38)>W$52,1,\nIF(($Q38+$C38)=W$52,(($R38-1)/12+(13-$R38)/12*r_eigenbau),\nIF(($Q38+Nutzungsdauer)>W$52,r_eigenbau,\nIF(($Q38+Nutzungsdauer)=W$52,($R38-1)/12*r_eigenbau,\n0)))))),0)\n*$M$34*$D$26*(1+$K$26)^W$51","v":0}]
[null,"Nettoersparnis",{"$f":"SUM(C56:C59)","v":0},0,0,0,0,0,0,0,0,0,0,0,0,0,0,0,0,0,{"$f":"SUM(U56:U59)","v":0},{"$f":"SUM(V56:V59)","v":0},{"$f":"SUM(W56:W59)","v":0},null,"Kapitalwert"]
[null,"Nettoeinsparung diskontiert (Barwert)",{"$f":"C60","v":0},{"$f":"D60*(1+D$30)^-D$51","v":0},0,0,0,0,0,0,0,0,0,0,0,0,0,0,0,0,{"$f":"U60*(1+U$30)^-U$51","v":0},{"$f":"V60*(1+V$30)^-V$51","v":0},{"$f":"W60*(1+W$30)^-W$51","v":0},{"$f":"SUM(C61:W61)","v":0},"Summe"]
[]
[null,"Eigenbau"]
[null,"Eingesparte Kosten",null,{"$f":"IF($R42>0,\nIF(D$52<$R42,0,\nIF($R42=D$52,(13-$S42)/12,\nIF(($R42+Nutzungsdauer)>D$52,1,\nIF(($R42+Nutzungsdauer)=D$52,($S42-1)/12,\n0)))),0)\n*$K$42*($J$34*(1+$E$26)^D$51+$K$34*(1+$F$26)^D$51+$L$34*(1+$G$26)^D$51+$N$34*(1+$H$26)^D$51+SUM($O$34:$Q$34))","v":0},0,0,0,0,0,0,0,0,0,0,0,0,0,0,0,0,{"$f":"IF($R42>0,\nIF(U$52<$R42,0,\nIF($R42=U$52,(13-$S42)/12,\nIF(($R42+Nutzungsdauer)>U$52,1,\nIF(($R42+Nutzungsdauer)=U$52,($S42-1)/12,\n0)))),0)\n*$K$42*($J$34*(1+$E$26)^U$51+$K$34*(1+$F$26)^U$51+$L$34*(1+$G$26)^U$51+$N$34*(1+$H$26)^U$51+SUM($O$34:$Q$34))","v":0},{"$f":"IF($R42>0,\nIF(V$52<$R42,0,\nIF($R42=V$52,(13-$S42)/12,\nIF(($R42+Nutzungsdauer)>V$52,1,\nIF(($R42+Nutzungsdauer)=V$52,($S42-1)/12,\n0)))),0)\n*$K$42*($J$34*(1+$E$26)^V$51+$K$34*(1+$F$26)^V$51+$L$34*(1+$G$26)^V$51+$N$34*(1+$H$26)^V$51+SUM($O$34:$Q$34))","v":0},{"$f":"IF($R42>0,\nIF(W$52<$R42,0,\nIF($R42=W$52,(13-$S42)/12,\nIF(($R42+Nutzungsdauer)>W$52,1,\nIF(($R42+Nutzungsdauer)=W$52,($S42-1)/12,\n0)))),0)\n*$K$42*($J$34*(1+$E$26)^W$51+$K$34*(1+$F$26)^W$51+$L$34*(1+$G$26)^W$51+$N$34*(1+$H$26)^W$51+SUM($O$34:$Q$34))","v":0}]
[null,"Investitionskosten",{"$f":"J42*-1","v":0}]
[null,"Ersatzinvestition inkl. deren Restwert am Ende des Betrachtungszeitraums",null,{"$f":"D58","v":0},{"$f":"E58","v":0},0,0,0,0,0,0,0,0,0,0,0,0,0,0,0,{"$f":"U58","v":0},{"$f":"V58","v":0},{"$f":"W58","v":0}]
[null,"Instandhaltungskosten Einsparmaßnahmen",null,{"$f":"-IF($Q38>0,\nIF(D$52<$Q38,0,\nIF($Q38=D$52,(13-$R38)/12,\nIF(($Q38+$C38)>D$52,1,\nIF(($Q38+$C38)=D$52,(($R38-1)/12),\n0)))),0)\n*($L$42*$F$42)*(1+$J$26)^D$51","v":0},0,0,0,0,0,0,0,0,0,0,0,0,0,0,0,0,{"$f":"-IF($Q38>0,\nIF(U$52<$Q38,0,\nIF($Q38=U$52,(13-$R38)/12,\nIF(($Q38+$C38)>U$52,1,\nIF(($Q38+$C38)=U$52,(($R38-1)/12),\n0)))),0)\n*($L$42*$F$42)*(1+$J$26)^U$51","v":0},{"$f":"-IF($Q38>0,\nIF(V$52<$Q38,0,\nIF($Q38=V$52,(13-$R38)/12,\nIF(($Q38+$C38)>V$52,1,\nIF(($Q38+$C38)=V$52,(($R38-1)/12),\n0)))),0)\n*($L$42*$F$42)*(1+$J$26)^V$51","v":0},{"$f":"-IF($Q38>0,\nIF(W$52<$Q38,0,\nIF($Q38=W$52,(13-$R38)/12,\nIF(($Q38+$C38)>W$52,1,\nIF(($Q38+$C38)=W$52,(($R38-1)/12),\n0)))),0)\n*($L$42*$F$42)*(1+$J$26)^W$51","v":0}]
[null,"Einsparung CO2-Emissionen",null,{"$f":"IF($R42>0,\nIF(D$52<$R42,0,\nIF($R42=D$52,(13-$S42)/12,\nIF(($R42+Nutzungsdauer)>D$52,1,\nIF(($R42+Nutzungsdauer)=D$52,($S42-1)/12,\n0)))),0)\n*$K$42*$M$34*$D$26*(1+$K$26)^D$51","v":0},0,0,0,0,0,0,0,0,0,0,0,0,0,0,0,0,{"$f":"IF($R42>0,\nIF(U$52<$R42,0,\nIF($R42=U$52,(13-$S42)/12,\nIF(($R42+Nutzungsdauer)>U$52,1,\nIF(($R42+Nutzungsdauer)=U$52,($S42-1)/12,\n0)))),0)\n*$K$42*$M$34*$D$26*(1+$K$26)^U$51","v":0},{"$f":"IF($R42>0,\nIF(V$52<$R42,0,\nIF($R42=V$52,(13-$S42)/12,\nIF(($R42+Nutzungsdauer)>V$52,1,\nIF(($R42+Nutzungsdauer)=V$52,($S42-1)/12,\n0)))),0)\n*$K$42*$M$34*$D$26*(1+$K$26)^V$51","v":0},{"$f":"IF($R42>0,\nIF(W$52<$R42,0,\nIF($R42=W$52,(13-$S42)/12,\nIF(($R42+Nutzungsdauer)>W$52,1,\nIF(($R42+Nutzungsdauer)=W$52,($S42-1)/12,\n0)))),0)\n*$K$42*$M$34*$D$26*(1+$K$26)^W$51","v":0}]
[null,"Nettoersparnis",{"$f":"SUM(C64:C68)","v":0},{"$f":"SUM(D64:D68)","v":0},0,0,0,0,0,0,0,0,0,0,0,0,0,0,{"$f":"SUM(S64:S68)","v":0},{"$f":"SUM(T64:T68)","v":0},{"$f":"SUM(U64:U68)","v":0},{"$f":"SUM(V64:V68)","v":0},{"$f":"SUM(W64:W68)","v":0},null,"Kapitalwert"]
[null,"Nettoeinsparung diskontiert (Barwert)",{"$f":"C69","v":0},{"$f":"D69*(1+D$30)^-D$51","v":0},0,0,0,0,0,0,0,0,0,0,0,0,0,0,0,0,{"$f":"U69*(1+U$30)^-U$51","v":0},{"$f":"V69*(1+V$30)^-V$51","v":0},{"$f":"W69*(1+W$30)^-W$51","v":0},{"$f":"SUM(C70:W70)","v":0},"Summe"]

{"sheet":"Nutzwertanalyse Eigenbau","index":5,"n_rows":35,"n_cols":5,"rows_kept":35,"cut":false,"hidden":false,"merged":[]}
[null,"Link zur Navigationseite"]
[]
[null,"Berechnungshilfe für die Angebotsbewertung und Wirtschaftlichkeitsuntersuchung im Energiespar-Contracting"]
[]
[null,"Nutzwertanalyse"]
[null,{"$f":"\"Contracting-Anbieter \"&INDEX(Angebotsvergleich!B44:B60,Eigenbau!$C$21)&\" vs. Eigenbaumaßnahme\"","v":"Contracting-Anbieter Anbieter 1 vs. Eigenbaumaßnahme"}]
[]
["Projekt:",{"$f":"Angebotsvergleich!$B$7","v":"Testprojekt"}]
["Datum:",{"$f":"Angebotsvergleich!$B$8","v":"2016-01-01"}]
["Bearbeiter:",{"$f":"Angebotsvergleich!$B$9","v":"Testbearbeiter"},null,"Berechnete Werte"]
[null,null,null,"Alle Kostenangaben netto"]
[null,"Eingaben in diesem Blatt:"]
[null,"keine, speist sich aus Tabellenblatt \"Eigenbau\""]
[]
[null,null,"Gewichtung"]
[null,"Bewertungskriterien","[%]",{"$f":"\"Eigenbau\nim Vergleich zu\n\"&INDEX(Angebotsvergleich!B44:B73,Eigenbau!$C$21)","v":"Eigenbau\nim Vergleich zu\nAnbieter 1"},{"$f":"INDEX(Angebotsvergleich!B44:B73,Eigenbau!$C$21)","v":"Anbieter 1"}]
[null,"Kapitalwert",{"$f":"'Nutzwertanalyse Angebotsvgl.'!C32","v":0},{"$f":"Eigenbau!X70","v":0},{"$f":"Eigenbau!X61","v":0}]
[null,"Forfaitierter Betrag in Vertragslaufzeit [€] (Risikoarmes Finanzierungskonzept)",{"$f":"'Nutzwertanalyse Angebotsvgl.'!C33","v":0},0,{"$f":"INDEX('Nutzwertanalyse Angebotsvgl.'!D33:AG33,bieter_nr)","v":""}]
[null,"Technisch-organisatorisches Konzept",{"$f":"'Nutzwertanalyse Angebotsvgl.'!C34","v":0},{"$f":"E19","v":0},{"$f":"INDEX('Nutzwertanalyse Angebotsvgl.'!D34:AG34,bieter_nr)","v":0}]
[null,"Summe",{"$f":"SUM(C17:C19)","v":0}]
[null,null,{"$f":"IF($C$20<>1,\"Gewichtungen bitte korrigieren:\",\"\")","v":"Gewichtungen bitte korrigieren:"}]
[null,"Kriterienerfüllung","verwendete Formel"]
[null,{"$f":"B17","v":"Kapitalwert"},"1.",{"$f":"IF(D17<>\"\",100*D17/MAX($E17:$E17),\"\")","v":{"$error":"#DIV/0!"}},{"$f":"IF(E17<>\"\",100*E17/MAX($E17:$E17),\"\")","v":{"$error":"#DIV/0!"}}]
[null,{"$f":"B18","v":"Forfaitierter Betrag in Vertragslaufzeit [€] (Risikoarmes Finanzierungskonzept)"},"2.",{"$f":"IF(D18>0,100-100*D18/MAX($E17:$E17),100)","v":100},{"$f":"IF(E18>0,100-100*E18/MAX($E18),100)","v":{"$error":"#VALUE!"}}]
[null,{"$f":"B19","v":"Technisch-organisatorisches Konzept"},"1.",{"$f":"IF(D19<>\"\",100*D19/MAX($E19:$E19),\"\")","v":{"$error":"#DIV/0!"}},{"$f":"IF(E19<>\"\",100*E19/MAX($E19:$E19),\"\")","v":{"$error":"#DIV/0!"}}]
[]
[null,"Teilnutzen"]
[null,{"$f":"B17","v":"Kapitalwert"},null,{"$f":"IF(D23<>\"\",D23*$C17,\"\")","v":{"$error":"#DIV/0!"}},{"$error":"#DIV/0!"}]
[null,{"$f":"B18","v":"Forfaitierter Betrag in Vertragslaufzeit [€] (Risikoarmes Finanzierungskonzept)"},null,0,{"$error":"#VALUE!"}]
[null,{"$f":"B19","v":"Technisch-organisatorisches Konzept"},null,{"$error":"#DIV/0!"},{"$error":"#DIV/0!"}]
[]
[null,"Nutzwert",null,{"$f":"D16","v":"Eigenbau\nim Vergleich zu\nAnbieter 1"},{"$f":"E16","v":"Anbieter 1"}]
[null,"Summe",null,{"$f":"SUM(D28:D30)","v":{"$error":"#DIV/0!"}},{"$f":"SUM(E28:E30)","v":{"$error":"#DIV/0!"}}]
[null,"Rang",null,{"$f":"RANK(D33,$D$33:$E$33)","v":{"$error":"#DIV/0!"}},{"$f":"RANK(E33,$D$33:$E$33)","v":{"$error":"#DIV/0!"}}]
[null,null,null,"Summe Punkte max. 100"]

{"sheet":"Angebotsübersicht","index":6,"n_rows":47,"n_cols":30,"rows_kept":47,"cut":false,"hidden":false,"merged":[]}
[null,"Link zur Navigationseite"]
[]
[null,"Berechnungshilfe für die Angebotsbewertung und Wirtschaftlichkeitsuntersuchung im Energiespar-Contracting"]
[]
[null,"Angebotsübersicht"]
[]
["Projekt:",{"$f":"Angebotsvergleich!$B$7","v":"Testprojekt"}]
["Datum:",{"$f":"Angebotsvergleich!$B$8","v":"2016-01-01"},null,"Berechnete Werte"]
["Bearbeiter:",{"$f":"Angebotsvergleich!$B$9","v":"Testbearbeiter"},null,"Alle Kostenangaben netto"]
[]
[]
[null,"Eingaben in diesem Blatt:"]
[null,"keine, speist sich aus Angebotsvergleich und dient der übersichtlichen Darstellung der Ergebnisse des Vergabeverfahrens"]
[]
["Baseline:",{"$f":"Angebotsvergleich!C19","v":0}]
[]
["Bieter","Nutzwertpunkte","Platz","Einspargarantie\nElektroenergie-Kosten\n[Euro/a]","Einspargarantie\nWärmeenergie-Kosten\n[Euro/a]","Einspargarantie\nWasser/Abwasser-Kosten\n[Euro/a]","Einsparung\nCO2-Emissionen\n[t CO2/a]","Einspargarantie\nsonstige jährliche Kosten\n[Euro/a]","Garantierte\nSteuerrückerstattung\n[Euro/a]","Garantierte\nEEG Vergütung\n[Euro/a]","Garantierte\nKWK Vergütung\n[Euro/a]","Summe Einspargarantie [Euro/a]","Einsparquote","Beteiligung\nAuftraggeber an \nGarantieein-sparung\n[%]","Haushalts-entlastung AG [Euro/a]","Contractingrate AN [Euro/a]","Dauer\nGarantie-phase\n[Jahre]","Summe Contractingrate [Euro]","Investitionen in \ntechnische Geräte, Anlagen und Sachen [Euro]","Investitionen des Contractors (ohne BKZ) [Euro]","Investitionen des Contractors geg. Vergütung Contr. [%]","Projektierungs-kosten\nFeinanalyse [Euro]","Einmaliger Baukosten-zuschuss des Auftraggebers [Euro]","Beginn \nGarantie-phase\n[Kalendermonat]","Forfaitierter \nBetrag [Euro/a]","Anteil Forfaitierung an Grundvergütung [Euro]","Kapitalwert [Euro]","Abweichung vom besten Kapitalwert \n[%]","Kennzeichnung maximal und minimal Kapitalwerte","Beteiligung\nAuftraggeber an zusätzl. Einsparung [%]"]
[{"$f":"Angebotsvergleich!B44","v":"Anbieter 1"},{"$f":"'Nutzwertanalyse Angebotsvgl.'!$D$48","v":{"$error":"#DIV/0!"}},{"$f":"'Nutzwertanalyse Angebotsvgl.'!$D$49","v":{"$error":"#DIV/0!"}},{"$f":"Angebotsvergleich!J44","v":0},{"$f":"Angebotsvergleich!K44","v":0},{"$f":"Angebotsvergleich!L44","v":0},{"$f":"Angebotsvergleich!M44","v":0},{"$f":"Angebotsvergleich!N44","v":0},{"$f":"Angebotsvergleich!O44","v":0},{"$f":"Angebotsvergleich!P44","v":0},{"$f":"Angebotsvergleich!Q44","v":0},{"$f":"Angebotsvergleich!R44","v":0},{"$f":"Angebotsvergleich!S44","v":""},{"$f":"IF(Angebotsvergleich!E77>0,1-Angebotsvergleich!E77,\"\")","v":""},{"$f":"Angebotsvergleich!I77","v":0},{"$f":"Angebotsvergleich!H77","v":0},{"$f":"Angebotsvergleich!C77","v":0},{"$f":"P18*Q18","v":0},{"$f":"Angebotsvergleich!L77","v":0},{"$f":"S18-W18","v":0},{"$f":"Angebotsvergleich!T44","v":""},{"$f":"Angebotsvergleich!M77","v":0},{"$f":"Angebotsvergleich!N77","v":0},{"$f":"Angebotsvergleich!O77","v":0},{"$f":"Angebotsvergleich!P77*12","v":0},{"$f":"Angebotsvergleich!S77","v":""},{"$f":"Angebotsvergleich!Z171","v":0},{"$f":"IF(AA18>0,1-AA18/MAX($AA$18:$AA$47),\"\")","v":""},{"$f":"IF(AB18=\"\",\"\",IF(AB18=0,\"maximal\",IF(AB18/MAX($AB$18:$AB$47)=1,\"minimal\",\"\")))","v":""},{"$f":"Angebotsvergleich!J77","v":0}]
[{"$f":"Angebotsvergleich!B45","v":"Anbieter 2"},{"$f":"'Nutzwertanalyse Angebotsvgl.'!$E$48","v":{"$error":"#DIV/0!"}},{"$f":"'Nutzwertanalyse Angebotsvgl.'!$E$49","v":{"$error":"#DIV/0!"}},{"$f":"Angebotsvergleich!J45","v":0},{"$f":"Angebotsvergleich!K45","v":0},{"$f":"Angebotsvergleich!L45","v":0},{"$f":"Angebotsvergleich!M45","v":0},{"$f":"Angebotsvergleich!N45","v":0},{"$f":"Angebotsvergleich!O45","v":0},{"$f":"Angebotsvergleich!P45","v":0},{"$f":"Angebotsvergleich!Q45","v":0},{"$f":"Angebotsvergleich!R45","v":0},{"$f":"Angebotsvergleich!S45","v":""},{"$f":"IF(Angebotsvergleich!E78>0,1-Angebotsvergleich!E78,\"\")","v":""},{"$f":"Angebotsvergleich!I78","v":0},{"$f":"Angebotsvergleich!H78","v":0},{"$f":"Angebotsvergleich!C78","v":0},{"$f":"P19*Q19","v":0},{"$f":"Angebotsvergleich!L78","v":0},{"$f":"S19-W19","v":0},{"$f":"Angebotsvergleich!T45","v":""},{"$f":"Angebotsvergleich!M78","v":0},{"$f":"Angebotsvergleich!N78","v":0},{"$f":"Angebotsvergleich!O78","v":0},{"$f":"Angebotsvergleich!P78*12","v":0},{"$f":"Angebotsvergleich!S78","v":""},{"$f":"Angebotsvergleich!Z180","v":0},{"$f":"IF(AA19>0,1-AA19/MAX($AA$18:$AA$47),\"\")","v":""},{"$f":"IF(AB19=\"\",\"\",IF(AB19=0,\"maximal\",IF(AB19/MAX($AB$18:$AB$47)=1,\"minimal\",\"\")))","v":""},{"$f":"Angebotsvergleich!J78","v":0}]
[{"$f":"Angebotsvergleich!B46","v":"Anbieter 3"},{"$f":"'Nutzwertanalyse Angebotsvgl.'!$F$48","v":{"$error":"#DIV/0!"}},{"$f":"'Nutzwertanalyse Angebotsvgl.'!$F$49","v":{"$error":"#DIV/0!"}},{"$f":"Angebotsvergleich!J46","v":0},{"$f":"Angebotsvergleich!K46","v":0},{"$f":"Angebotsvergleich!L46","v":0},{"$f":"Angebotsvergleich!M46","v":0},{"$f":"Angebotsvergleich!N46","v":0},{"$f":"Angebotsvergleich!O46","v":0},{"$f":"Angebotsvergleich!P46","v":0},{"$f":"Angebotsvergleich!Q46","v":0},{"$f":"Angebotsvergleich!R46","v":0},{"$f":"Angebotsvergleich!S46","v":""},{"$f":"IF(Angebotsvergleich!E79>0,1-Angebotsvergleich!E79,\"\")","v":""},{"$f":"Angebotsvergleich!I79","v":0},{"$f":"Angebotsvergleich!H79","v":0},{"$f":"Angebotsvergleich!C79","v":0},0,{"$f":"Angebotsvergleich!L79","v":0},0,{"$f":"Angebotsvergleich!T46","v":""},{"$f":"Angebotsvergleich!M79","v":0},{"$f":"Angebotsvergleich!N79","v":0},{"$f":"Angebotsvergleich!O79","v":0},{"$f":"Angebotsvergleich!P79*12","v":0},{"$f":"Angebotsvergleich!S79","v":""},{"$f":"Angebotsvergleich!Z189","v":0},"","",{"$f":"Angebotsvergleich!J79","v":0}]
[{"$f":"Angebotsvergleich!B47","v":"Anbieter 4"},{"$f":"'Nutzwertanalyse Angebotsvgl.'!$G$48","v":{"$error":"#DIV/0!"}},{"$f":"'Nutzwertanalyse Angebotsvgl.'!$G$49","v":{"$error":"#DIV/0!"}},{"$f":"Angebotsvergleich!J47","v":0},{"$f":"Angebotsvergleich!K47","v":0},{"$f":"Angebotsvergleich!L47","v":0},{"$f":"Angebotsvergleich!M47","v":0},{"$f":"Angebotsvergleich!N47","v":0},{"$f":"Angebotsvergleich!O47","v":0},{"$f":"Angebotsvergleich!P47","v":0},{"$f":"Angebotsvergleich!Q47","v":0},{"$f":"Angebotsvergleich!R47","v":0},{"$f":"Angebotsvergleich!S47","v":""},{"$f":"IF(Angebotsvergleich!E80>0,1-Angebotsvergleich!E80,\"\")","v":""},{"$f":"Angebotsvergleich!I80","v":0},{"$f":"Angebotsvergleich!H80","v":0},{"$f":"Angebotsvergleich!C80","v":0},0,{"$f":"Angebotsvergleich!L80","v":0},0,{"$f":"Angebotsvergleich!T47","v":""},{"$f":"Angebotsvergleich!M80","v":0},{"$f":"Angebotsvergleich!N80","v":0},{"$f":"Angebotsvergleich!O80","v":0},{"$f":"Angebotsvergleich!P80*12","v":0},{"$f":"Angebotsvergleich!S80","v":""},{"$f":"Angebotsvergleich!Z198","v":0},"","",{"$f":"Angebotsvergleich!J80","v":0}]
[{"$f":"Angebotsvergleich!B48","v":"Anbieter 5"},{"$f":"'Nutzwertanalyse Angebotsvgl.'!$H$48","v":{"$error":"#DIV/0!"}},{"$f":"'Nutzwertanalyse Angebotsvgl.'!$H$49","v":{"$error":"#DIV/0!"}},{"$f":"Angebotsvergleich!J48","v":0},{"$f":"Angebotsvergleich!K48","v":0},{"$f":"Angebotsvergleich!L48","v":0},{"$f":"Angebotsvergleich!M48","v":0},{"$f":"Angebotsvergleich!N48","v":0},{"$f":"Angebotsvergleich!O48","v":0},{"$f":"Angebotsvergleich!P48","v":0},{"$f":"Angebotsvergleich!Q48","v":0},{"$f":"Angebotsvergleich!R48","v":0},{"$f":"Angebotsvergleich!S48","v":""},{"$f":"IF(Angebotsvergleich!E81>0,1-Angebotsvergleich!E81,\"\")","v":""},{"$f":"Angebotsvergleich!I81","v":0},{"$f":"Angebotsvergleich!H81","v":0},{"$f":"Angebotsvergleich!C81","v":0},0,{"$f":"Angebotsvergleich!L81","v":0},0,{"$f":"Angebotsvergleich!T48","v":""},{"$f":"Angebotsvergleich!M81","v":0},{"$f":"Angebotsvergleich!N81","v":0},{"$f":"Angebotsvergleich!O81","v":0},{"$f":"Angebotsvergleich!P81*12","v":0},{"$f":"Angebotsvergleich!S81","v":""},{"$f":"Angebotsvergleich!Z207","v":0},"","",{"$f":"Angebotsvergleich!J81","v":0}]
[{"$f":"Angebotsvergleich!B49","v":"Anbieter 6"},{"$f":"'Nutzwertanalyse Angebotsvgl.'!$I$48","v":{"$error":"#DIV/0!"}},{"$f":"'Nutzwertanalyse Angebotsvgl.'!$I$49","v":{"$error":"#DIV/0!"}},{"$f":"Angebotsvergleich!J49","v":0},{"$f":"Angebotsvergleich!K49","v":0},{"$f":"Angebotsvergleich!L49","v":0},{"$f":"Angebotsvergleich!M49","v":0},{"$f":"Angebotsvergleich!N49","v":0},{"$f":"Angebotsvergleich!O49","v":0},{"$f":"Angebotsvergleich!P49","v":0},{"$f":"Angebotsvergleich!Q49","v":0},{"$f":"Angebotsvergleich!R49","v":0},{"$f":"Angebotsvergleich!S49","v":""},{"$f":"IF(Angebotsvergleich!E82>0,1-Angebotsvergleich!E82,\"\")","v":""},{"$f":"Angebotsvergleich!I82","v":0},{"$f":"Angebotsvergleich!H82","v":0},{"$f":"Angebotsvergleich!C82","v":0},0,{"$f":"Angebotsvergleich!L82","v":0},0,{"$f":"Angebotsvergleich!T49","v":""},{"$f":"Angebotsvergleich!M82","v":0},{"$f":"Angebotsvergleich!N82","v":0},{"$f":"Angebotsvergleich!O82","v":0},{"$f":"Angebotsvergleich!P82*12","v":0},{"$f":"Angebotsvergleich!S82","v":""},{"$f":"Angebotsvergleich!Z216","v":0},"","",{"$f":"Angebotsvergleich!J82","v":0}]
[{"$f":"Angebotsvergleich!B50","v":"Anbieter 7"},{"$f":"'Nutzwertanalyse Angebotsvgl.'!$J$48","v":{"$error":"#DIV/0!"}},{"$f":"'Nutzwertanalyse Angebotsvgl.'!$J$49","v":{"$error":"#DIV/0!"}},{"$f":"Angebotsvergleich!J50","v":0},{"$f":"Angebotsvergleich!K50","v":0},{"$f":"Angebotsvergleich!L50","v":0},{"$f":"Angebotsvergleich!M50","v":0},{"$f":"Angebotsvergleich!N50","v":0},{"$f":"Angebotsvergleich!O50","v":0},{"$f":"Angebotsvergleich!P50","v":0},{"$f":"Angebotsvergleich!Q50","v":0},{"$f":"Angebotsvergleich!R50","v":0},{"$f":"Angebotsvergleich!S50","v":""},{"$f":"IF(Angebotsvergleich!E83>0,1-Angebotsvergleich!E83,\"\")","v":""},{"$f":"Angebotsvergleich!I83","v":0},{"$f":"Angebotsvergleich!H83","v":0},{"$f":"Angebotsvergleich!C83","v":0},0,{"$f":"Angebotsvergleich!L83","v":0},0,{"$f":"Angebotsvergleich!T50","v":""},{"$f":"Angebotsvergleich!M83","v":0},{"$f":"Angebotsvergleich!N83","v":0},{"$f":"Angebotsvergleich!O83","v":0},{"$f":"Angebotsvergleich!P83*12","v":0},{"$f":"Angebotsvergleich!S83","v":""},{"$f":"Angebotsvergleich!Z225","v":0},"","",{"$f":"Angebotsvergleich!J83","v":0}]
[{"$f":"Angebotsvergleich!B51","v":"Anbieter 8"},{"$f":"'Nutzwertanalyse Angebotsvgl.'!$K$48","v":{"$error":"#DIV/0!"}},{"$f":"'Nutzwertanalyse Angebotsvgl.'!$K$49","v":{"$error":"#DIV/0!"}},{"$f":"Angebotsvergleich!J51","v":0},{"$f":"Angebotsvergleich!K51","v":0},{"$f":"Angebotsvergleich!L51","v":0},{"$f":"Angebotsvergleich!M51","v":0},{"$f":"Angebotsvergleich!N51","v":0},{"$f":"Angebotsvergleich!O51","v":0},{"$f":"Angebotsvergleich!P51","v":0},{"$f":"Angebotsvergleich!Q51","v":0},{"$f":"Angebotsvergleich!R51","v":0},{"$f":"Angebotsvergleich!S51","v":""},{"$f":"IF(Angebotsvergleich!E84>0,1-Angebotsvergleich!E84,\"\")","v":""},{"$f":"Angebotsvergleich!I84","v":0},{"$f":"Angebotsvergleich!H84","v":0},{"$f":"Angebotsvergleich!C84","v":0},0,{"$f":"Angebotsvergleich!L84","v":0},0,{"$f":"Angebotsvergleich!T51","v":""},{"$f":"Angebotsvergleich!M84","v":0},{"$f":"Angebotsvergleich!N84","v":0},{"$f":"Angebotsvergleich!O84","v":0},{"$f":"Angebotsvergleich!P84*12","v":0},{"$f":"Angebotsvergleich!S84","v":""},{"$f":"Angebotsvergleich!Z234","v":0},"","",{"$f":"Angebotsvergleich!J84","v":0}]
[{"$f":"Angebotsvergleich!B52","v":"Anbieter 9"},{"$f":"'Nutzwertanalyse Angebotsvgl.'!$L$48","v":{"$error":"#DIV/0!"}},{"$f":"'Nutzwertanalyse Angebotsvgl.'!$L$49","v":{"$error":"#DIV/0!"}},{"$f":"Angebotsvergleich!J52","v":0},{"$f":"Angebotsvergleich!K52","v":0},{"$f":"Angebotsvergleich!L52","v":0},{"$f":"Angebotsvergleich!M52","v":0},{"$f":"Angebotsvergleich!N52","v":0},{"$f":"Angebotsvergleich!O52","v":0},{"$f":"Angebotsvergleich!P52","v":0},{"$f":"Angebotsvergleich!Q52","v":0},{"$f":"Angebotsvergleich!R52","v":0},{"$f":"Angebotsvergleich!S52","v":""},{"$f":"IF(Angebotsvergleich!E85>0,1-Angebotsvergleich!E85,\"\")","v":""},{"$f":"Angebotsvergleich!I85","v":0},{"$f":"Angebotsvergleich!H85","v":0},{"$f":"Angebotsvergleich!C85","v":0},0,{"$f":"Angebotsvergleich!L85","v":0},0,{"$f":"Angebotsvergleich!T52","v":""},{"$f":"Angebotsvergleich!M85","v":0},{"$f":"Angebotsvergleich!N85","v":0},{"$f":"Angebotsvergleich!O85","v":0},{"$f":"Angebotsvergleich!P85*12","v":0},{"$f":"Angebotsvergleich!S85","v":""},{"$f":"Angebotsvergleich!Z243","v":0},"","",{"$f":"Angebotsvergleich!J85","v":0}]
[{"$f":"Angebotsvergleich!B53","v":"Anbieter 10"},{"$f":"'Nutzwertanalyse Angebotsvgl.'!$M$48","v":{"$error":"#DIV/0!"}},{"$f":"'Nutzwertanalyse Angebotsvgl.'!$M$49","v":{"$error":"#DIV/0!"}},{"$f":"Angebotsvergleich!J53","v":0},{"$f":"Angebotsvergleich!K53","v":0},{"$f":"Angebotsvergleich!L53","v":0},{"$f":"Angebotsvergleich!M53","v":0},{"$f":"Angebotsvergleich!N53","v":0},{"$f":"Angebotsvergleich!O53","v":0},{"$f":"Angebotsvergleich!P53","v":0},{"$f":"Angebotsvergleich!Q53","v":0},{"$f":"Angebotsvergleich!R53","v":0},{"$f":"Angebotsvergleich!S53","v":""},{"$f":"IF(Angebotsvergleich!E86>0,1-Angebotsvergleich!E86,\"\")","v":""},{"$f":"Angebotsvergleich!I86","v":0},{"$f":"Angebotsvergleich!H86","v":0},{"$f":"Angebotsvergleich!C86","v":0},0,{"$f":"Angebotsvergleich!L86","v":0},0,{"$f":"Angebotsvergleich!T53","v":""},{"$f":"Angebotsvergleich!M86","v":0},{"$f":"Angebotsvergleich!N86","v":0},{"$f":"Angebotsvergleich!O86","v":0},{"$f":"Angebotsvergleich!P86*12","v":0},{"$f":"Angebotsvergleich!S86","v":""},{"$f":"Angebotsvergleich!Z252","v":0},"","",{"$f":"Angebotsvergleich!J86","v":0}]
[{"$f":"Angebotsvergleich!B54","v":"Anbieter 11"},{"$f":"'Nutzwertanalyse Angebotsvgl.'!$N$48","v":{"$error":"#DIV/0!"}},{"$f":"'Nutzwertanalyse Angebotsvgl.'!$N$49","v":{"$error":"#DIV/0!"}},{"$f":"Angebotsvergleich!J54","v":0},{"$f":"Angebotsvergleich!K54","v":0},{"$f":"Angebotsvergleich!L54","v":0},{"$f":"Angebotsvergleich!M54","v":0},{"$f":"Angebotsvergleich!N54","v":0},{"$f":"Angebotsvergleich!O54","v":0},{"$f":"Angebotsvergleich!P54","v":0},{"$f":"Angebotsvergleich!Q54","v":0},{"$f":"Angebotsvergleich!R54","v":0},{"$f":"Angebotsvergleich!S54","v":""},{"$f":"IF(Angebotsvergleich!E87>0,1-Angebotsvergleich!E87,\"\")","v":""},{"$f":"Angebotsvergleich!I87","v":0},{"$f":"Angebotsvergleich!H87","v":0},{"$f":"Angebotsvergleich!C87","v":0},0,{"$f":"Angebotsvergleich!L87","v":0},0,{"$f":"Angebotsvergleich!T54","v":""},{"$f":"Angebotsvergleich!M87","v":0},{"$f":"Angebotsvergleich!N87","v":0},{"$f":"Angebotsvergleich!O87","v":0},{"$f":"Angebotsvergleich!P87*12","v":0},{"$f":"Angebotsvergleich!S87","v":""},{"$f":"Angebotsvergleich!Z261","v":0},"","",{"$f":"Angebotsvergleich!J87","v":0}]
[{"$f":"Angebotsvergleich!B55","v":"Anbieter 12"},{"$f":"'Nutzwertanalyse Angebotsvgl.'!$O$48","v":{"$error":"#DIV/0!"}},{"$f":"'Nutzwertanalyse Angebotsvgl.'!$O$49","v":{"$error":"#DIV/0!"}},{"$f":"Angebotsvergleich!J55","v":0},{"$f":"Angebotsvergleich!K55","v":0},{"$f":"Angebotsvergleich!L55","v":0},{"$f":"Angebotsvergleich!M55","v":0},{"$f":"Angebotsvergleich!N55","v":0},{"$f":"Angebotsvergleich!O55","v":0},{"$f":"Angebotsvergleich!P55","v":0},{"$f":"Angebotsvergleich!Q55","v":0},{"$f":"Angebotsvergleich!R55","v":0},{"$f":"Angebotsvergleich!S55","v":""},{"$f":"IF(Angebotsvergleich!E88>0,1-Angebotsvergleich!E88,\"\")","v":""},{"$f":"Angebotsvergleich!I88","v":0},{"$f":"Angebotsvergleich!H88","v":0},{"$f":"Angebotsvergleich!C88","v":0},0,{"$f":"Angebotsvergleich!L88","v":0},0,{"$f":"Angebotsvergleich!T55","v":""},{"$f":"Angebotsvergleich!M88","v":0},{"$f":"Angebotsvergleich!N88","v":0},{"$f":"Angebotsvergleich!O88","v":0},{"$f":"Angebotsvergleich!P88*12","v":0},{"$f":"Angebotsvergleich!S88","v":""},{"$f":"Angebotsvergleich!Z270","v":0},"","",{"$f":"Angebotsvergleich!J88","v":0}]
[{"$f":"Angebotsvergleich!B56","v":"Anbieter 13"},{"$f":"'Nutzwertanalyse Angebotsvgl.'!$P$48","v":{"$error":"#DIV/0!"}},{"$f":"'Nutzwertanalyse Angebotsvgl.'!$P$49","v":{"$error":"#DIV/0!"}},{"$f":"Angebotsvergleich!J56","v":0},{"$f":"Angebotsvergleich!K56","v":0},{"$f":"Angebotsvergleich!L56","v":0},{"$f":"Angebotsvergleich!M56","v":0},{"$f":"Angebotsvergleich!N56","v":0},{"$f":"Angebotsvergleich!O56","v":0},{"$f":"Angebotsvergleich!P56","v":0},{"$f":"Angebotsvergleich!Q56","v":0},{"$f":"Angebotsvergleich!R56","v":0},{"$f":"Angebotsvergleich!S56","v":""},{"$f":"IF(Angebotsvergleich!E89>0,1-Angebotsvergleich!E89,\"\")","v":""},{"$f":"Angebotsvergleich!I89","v":0},{"$f":"Angebotsvergleich!H89","v":0},{"$f":"Angebotsvergleich!C89","v":0},0,{"$f":"Angebotsvergleich!L89","v":0},0,{"$f":"Angebotsvergleich!T56","v":""},{"$f":"Angebotsvergleich!M89","v":0},{"$f":"Angebotsvergleich!N89","v":0},{"$f":"Angebotsvergleich!O89","v":0},{"$f":"Angebotsvergleich!P89*12","v":0},{"$f":"Angebotsvergleich!S89","v":""},{"$f":"Angebotsvergleich!Z279","v":0},"","",{"$f":"Angebotsvergleich!J89","v":0}]
[{"$f":"Angebotsvergleich!B57","v":"Anbieter 14"},{"$f":"'Nutzwertanalyse Angebotsvgl.'!$Q$48","v":{"$error":"#DIV/0!"}},{"$f":"'Nutzwertanalyse Angebotsvgl.'!$Q$49","v":{"$error":"#DIV/0!"}},{"$f":"Angebotsvergleich!J57","v":0},{"$f":"Angebotsvergleich!K57","v":0},{"$f":"Angebotsvergleich!L57","v":0},{"$f":"Angebotsvergleich!M57","v":0},{"$f":"Angebotsvergleich!N57","v":0},{"$f":"Angebotsvergleich!O57","v":0},{"$f":"Angebotsvergleich!P57","v":0},{"$f":"Angebotsvergleich!Q57","v":0},{"$f":"Angebotsvergleich!R57","v":0},{"$f":"Angebotsvergleich!S57","v":""},{"$f":"IF(Angebotsvergleich!E90>0,1-Angebotsvergleich!E90,\"\")","v":""},{"$f":"Angebotsvergleich!I90","v":0},{"$f":"Angebotsvergleich!H90","v":0},{"$f":"Angebotsvergleich!C90","v":0},0,{"$f":"Angebotsvergleich!L90","v":0},0,{"$f":"Angebotsvergleich!T57","v":""},{"$f":"Angebotsvergleich!M90","v":0},{"$f":"Angebotsvergleich!N90","v":0},{"$f":"Angebotsvergleich!O90","v":0},{"$f":"Angebotsvergleich!P90*12","v":0},{"$f":"Angebotsvergleich!S90","v":""},{"$f":"Angebotsvergleich!Z288","v":0},"","",{"$f":"Angebotsvergleich!J90","v":0}]
[{"$f":"Angebotsvergleich!B58","v":"Anbieter 15"},{"$f":"'Nutzwertanalyse Angebotsvgl.'!$R$48","v":{"$error":"#DIV/0!"}},{"$f":"'Nutzwertanalyse Angebotsvgl.'!$R$49","v":{"$error":"#DIV/0!"}},{"$f":"Angebotsvergleich!J58","v":0},{"$f":"Angebotsvergleich!K58","v":0},{"$f":"Angebotsvergleich!L58","v":0},{"$f":"Angebotsvergleich!M58","v":0},{"$f":"Angebotsvergleich!N58","v":0},{"$f":"Angebotsvergleich!O58","v":0},{"$f":"Angebotsvergleich!P58","v":0},{"$f":"Angebotsvergleich!Q58","v":0},{"$f":"Angebotsvergleich!R58","v":0},{"$f":"Angebotsvergleich!S58","v":""},{"$f":"IF(Angebotsvergleich!E91>0,1-Angebotsvergleich!E91,\"\")","v":""},{"$f":"Angebotsvergleich!I91","v":0},{"$f":"Angebotsvergleich!H91","v":0},{"$f":"Angebotsvergleich!C91","v":0},0,{"$f":"Angebotsvergleich!L91","v":0},0,{"$f":"Angebotsvergleich!T58","v":""},{"$f":"Angebotsvergleich!M91","v":0},{"$f":"Angebotsvergleich!N91","v":0},{"$f":"Angebotsvergleich!O91","v":0},{"$f":"Angebotsvergleich!P91*12","v":0},{"$f":"Angebotsvergleich!S91","v":""},{"$f":"Angebotsvergleich!Z297","v":0},"","",{"$f":"Angebotsvergleich!J91","v":0}]
[{"$f":"Angebotsvergleich!B59","v":"Anbieter 16"},{"$f":"'Nutzwertanalyse Angebotsvgl.'!$S$48","v":{"$error":"#DIV/0!"}},{"$f":"'Nutzwertanalyse Angebotsvgl.'!$S$49","v":{"$error":"#DIV/0!"}},{"$f":"Angebotsvergleich!J59","v":0},{"$f":"Angebotsvergleich!K59","v":0},{"$f":"Angebotsvergleich!L59","v":0},{"$f":"Angebotsvergleich!M59","v":0},{"$f":"Angebotsvergleich!N59","v":0},{"$f":"Angebotsvergleich!O59","v":0},{"$f":"Angebotsvergleich!P59","v":0},{"$f":"Angebotsvergleich!Q59","v":0},{"$f":"Angebotsvergleich!R59","v":0},{"$f":"Angebotsvergleich!S59","v":""},{"$f":"IF(Angebotsvergleich!E92>0,1-Angebotsvergleich!E92,\"\")","v":""},{"$f":"Angebotsvergleich!I92","v":0},{"$f":"Angebotsvergleich!H92","v":0},{"$f":"Angebotsvergleich!C92","v":0},0,{"$f":"Angebotsvergleich!L92","v":0},0,{"$f":"Angebotsvergleich!T59","v":""},{"$f":"Angebotsvergleich!M92","v":0},{"$f":"Angebotsvergleich!N92","v":0},{"$f":"Angebotsvergleich!O92","v":0},{"$f":"Angebotsvergleich!P92*12","v":0},{"$f":"Angebotsvergleich!S92","v":""},{"$f":"Angebotsvergleich!Z306","v":0},"","",{"$f":"Angebotsvergleich!J92","v":0}]
[{"$f":"Angebotsvergleich!B60","v":"Anbieter 17"},{"$f":"'Nutzwertanalyse Angebotsvgl.'!$T$48","v":{"$error":"#DIV/0!"}},{"$f":"'Nutzwertanalyse Angebotsvgl.'!$T$49","v":{"$error":"#DIV/0!"}},{"$f":"Angebotsvergleich!J60","v":0},{"$f":"Angebotsvergleich!K60","v":0},{"$f":"Angebotsvergleich!L60","v":0},{"$f":"Angebotsvergleich!M60","v":0},{"$f":"Angebotsvergleich!N60","v":0},{"$f":"Angebotsvergleich!O60","v":0},{"$f":"Angebotsvergleich!P60","v":0},{"$f":"Angebotsvergleich!Q60","v":0},{"$f":"Angebotsvergleich!R60","v":0},{"$f":"Angebotsvergleich!S60","v":""},{"$f":"IF(Angebotsvergleich!E93>0,1-Angebotsvergleich!E93,\"\")","v":""},{"$f":"Angebotsvergleich!I93","v":0},{"$f":"Angebotsvergleich!H93","v":0},{"$f":"Angebotsvergleich!C93","v":0},0,{"$f":"Angebotsvergleich!L93","v":0},0,{"$f":"Angebotsvergleich!T60","v":""},{"$f":"Angebotsvergleich!M93","v":0},{"$f":"Angebotsvergleich!N93","v":0},{"$f":"Angebotsvergleich!O93","v":0},{"$f":"Angebotsvergleich!P93*12","v":0},{"$f":"Angebotsvergleich!S93","v":""},{"$f":"Angebotsvergleich!Z315","v":0},"","",{"$f":"Angebotsvergleich!J93","v":0}]
[{"$f":"Angebotsvergleich!B61","v":"Anbieter 18"},{"$f":"'Nutzwertanalyse Angebotsvgl.'!$U$48","v":{"$error":"#DIV/0!"}},{"$f":"'Nutzwertanalyse Angebotsvgl.'!$U$49","v":{"$error":"#DIV/0!"}},{"$f":"Angebotsvergleich!J61","v":0},{"$f":"Angebotsvergleich!K61","v":0},{"$f":"Angebotsvergleich!L61","v":0},{"$f":"Angebotsvergleich!M61","v":0},{"$f":"Angebotsvergleich!N61","v":0},{"$f":"Angebotsvergleich!O61","v":0},{"$f":"Angebotsvergleich!P61","v":0},{"$f":"Angebotsvergleich!Q61","v":0},{"$f":"Angebotsvergleich!R61","v":0},{"$f":"Angebotsvergleich!S61","v":""},{"$f":"IF(Angebotsvergleich!E94>0,1-Angebotsvergleich!E94,\"\")","v":""},{"$f":"Angebotsvergleich!I94","v":0},{"$f":"Angebotsvergleich!H94","v":0},{"$f":"Angebotsvergleich!C94","v":0},0,{"$f":"Angebotsvergleich!L94","v":0},0,{"$f":"Angebotsvergleich!T61","v":""},{"$f":"Angebotsvergleich!M94","v":0},{"$f":"Angebotsvergleich!N94","v":0},{"$f":"Angebotsvergleich!O94","v":0},{"$f":"Angebotsvergleich!P94*12","v":0},{"$f":"Angebotsvergleich!S94","v":""},{"$f":"Angebotsvergleich!Z324","v":0},"","",{"$f":"Angebotsvergleich!J94","v":0}]
[{"$f":"Angebotsvergleich!B62","v":"Anbieter 19"},{"$f":"'Nutzwertanalyse Angebotsvgl.'!$V$48","v":{"$error":"#DIV/0!"}},{"$f":"'Nutzwertanalyse Angebotsvgl.'!$V$49","v":{"$error":"#DIV/0!"}},{"$f":"Angebotsvergleich!J62","v":0},{"$f":"Angebotsvergleich!K62","v":0},{"$f":"Angebotsvergleich!L62","v":0},{"$f":"Angebotsvergleich!M62","v":0},{"$f":"Angebotsvergleich!N62","v":0},{"$f":"Angebotsvergleich!O62","v":0},{"$f":"Angebotsvergleich!P62","v":0},{"$f":"Angebotsvergleich!Q62","v":0},{"$f":"Angebotsvergleich!R62","v":0},{"$f":"Angebotsvergleich!S62","v":""},{"$f":"IF(Angebotsvergleich!E95>0,1-Angebotsvergleich!E95,\"\")","v":""},{"$f":"Angebotsvergleich!I95","v":0},{"$f":"Angebotsvergleich!H95","v":0},{"$f":"Angebotsvergleich!C95","v":0},0,{"$f":"Angebotsvergleich!L95","v":0},0,{"$f":"Angebotsvergleich!T62","v":""},{"$f":"Angebotsvergleich!M95","v":0},{"$f":"Angebotsvergleich!N95","v":0},{"$f":"Angebotsvergleich!O95","v":0},{"$f":"Angebotsvergleich!P95*12","v":0},{"$f":"Angebotsvergleich!S95","v":""},{"$f":"Angebotsvergleich!Z333","v":0},"","",{"$f":"Angebotsvergleich!J95","v":0}]
[{"$f":"Angebotsvergleich!B63","v":"Anbieter 20"},{"$f":"'Nutzwertanalyse Angebotsvgl.'!$W$48","v":{"$error":"#DIV/0!"}},{"$f":"'Nutzwertanalyse Angebotsvgl.'!$W$49","v":{"$error":"#DIV/0!"}},{"$f":"Angebotsvergleich!J63","v":0},{"$f":"Angebotsvergleich!K63","v":0},{"$f":"Angebotsvergleich!L63","v":0},{"$f":"Angebotsvergleich!M63","v":0},{"$f":"Angebotsvergleich!N63","v":0},{"$f":"Angebotsvergleich!O63","v":0},{"$f":"Angebotsvergleich!P63","v":0},{"$f":"Angebotsvergleich!Q63","v":0},{"$f":"Angebotsvergleich!R63","v":0},{"$f":"Angebotsvergleich!S63","v":""},{"$f":"IF(Angebotsvergleich!E96>0,1-Angebotsvergleich!E96,\"\")","v":""},{"$f":"Angebotsvergleich!I96","v":0},{"$f":"Angebotsvergleich!H96","v":0},{"$f":"Angebotsvergleich!C96","v":0},0,{"$f":"Angebotsvergleich!L96","v":0},0,{"$f":"Angebotsvergleich!T63","v":""},{"$f":"Angebotsvergleich!M96","v":0},{"$f":"Angebotsvergleich!N96","v":0},{"$f":"Angebotsvergleich!O96","v":0},{"$f":"Angebotsvergleich!P96*12","v":0},{"$f":"Angebotsvergleich!S96","v":""},{"$f":"Angebotsvergleich!Z342","v":0},"","",{"$f":"Angebotsvergleich!J96","v":0}]
[{"$f":"Angebotsvergleich!B64","v":"Anbieter 21"},{"$f":"'Nutzwertanalyse Angebotsvgl.'!$X$48","v":{"$error":"#DIV/0!"}},{"$f":"'Nutzwertanalyse Angebotsvgl.'!$X$49","v":{"$error":"#DIV/0!"}},{"$f":"Angebotsvergleich!J64","v":0},{"$f":"Angebotsvergleich!K64","v":0},{"$f":"Angebotsvergleich!L64","v":0},{"$f":"Angebotsvergleich!M64","v":0},{"$f":"Angebotsvergleich!N64","v":0},{"$f":"Angebotsvergleich!O64","v":0},{"$f":"Angebotsvergleich!P64","v":0},{"$f":"Angebotsvergleich!Q64","v":0},{"$f":"Angebotsvergleich!R64","v":0},{"$f":"Angebotsvergleich!S64","v":""},{"$f":"IF(Angebotsvergleich!E97>0,1-Angebotsvergleich!E97,\"\")","v":""},{"$f":"Angebotsvergleich!I97","v":0},{"$f":"Angebotsvergleich!H97","v":0},{"$f":"Angebotsvergleich!C97","v":0},0,{"$f":"Angebotsvergleich!L97","v":0},0,{"$f":"Angebotsvergleich!T64","v":""},{"$f":"Angebotsvergleich!M97","v":0},{"$f":"Angebotsvergleich!N97","v":0},{"$f":"Angebotsvergleich!O97","v":0},{"$f":"Angebotsvergleich!P97*12","v":0},{"$f":"Angebotsvergleich!S97","v":""},{"$f":"Angebotsvergleich!Z351","v":0},"","",{"$f":"Angebotsvergleich!J97","v":0}]
[{"$f":"Angebotsvergleich!B65","v":"Anbieter 22"},{"$f":"'Nutzwertanalyse Angebotsvgl.'!$Y$48","v":{"$error":"#DIV/0!"}},{"$f":"'Nutzwertanalyse Angebotsvgl.'!$Y$49","v":{"$error":"#DIV/0!"}},{"$f":"Angebotsvergleich!J65","v":0},{"$f":"Angebotsvergleich!K65","v":0},{"$f":"Angebotsvergleich!L65","v":0},{"$f":"Angebotsvergleich!M65","v":0},{"$f":"Angebotsvergleich!N65","v":0},{"$f":"Angebotsvergleich!O65","v":0},{"$f":"Angebotsvergleich!P65","v":0},{"$f":"Angebotsvergleich!Q65","v":0},{"$f":"Angebotsvergleich!R65","v":0},{"$f":"Angebotsvergleich!S65","v":""},{"$f":"IF(Angebotsvergleich!E98>0,1-Angebotsvergleich!E98,\"\")","v":""},{"$f":"Angebotsvergleich!I98","v":0},{"$f":"Angebotsvergleich!H98","v":0},{"$f":"Angebotsvergleich!C98","v":0},0,{"$f":"Angebotsvergleich!L98","v":0},0,{"$f":"Angebotsvergleich!T65","v":""},{"$f":"Angebotsvergleich!M98","v":0},{"$f":"Angebotsvergleich!N98","v":0},{"$f":"Angebotsvergleich!O98","v":0},{"$f":"Angebotsvergleich!P98*12","v":0},{"$f":"Angebotsvergleich!S98","v":""},{"$f":"Angebotsvergleich!Z360","v":0},"","",{"$f":"Angebotsvergleich!J98","v":0}]
[{"$f":"Angebotsvergleich!B66","v":"Anbieter 23"},{"$f":"'Nutzwertanalyse Angebotsvgl.'!$Z$48","v":{"$error":"#DIV/0!"}},{"$f":"'Nutzwertanalyse Angebotsvgl.'!$Z$49","v":{"$error":"#DIV/0!"}},{"$f":"Angebotsvergleich!J66","v":0},{"$f":"Angebotsvergleich!K66","v":0},{"$f":"Angebotsvergleich!L66","v":0},{"$f":"Angebotsvergleich!M66","v":0},{"$f":"Angebotsvergleich!N66","v":0},{"$f":"Angebotsvergleich!O66","v":0},{"$f":"Angebotsvergleich!P66","v":0},{"$f":"Angebotsvergleich!Q66","v":0},{"$f":"Angebotsvergleich!R66","v":0},{"$f":"Angebotsvergleich!S66","v":""},{"$f":"IF(Angebotsvergleich!E99>0,1-Angebotsvergleich!E99,\"\")","v":""},{"$f":"Angebotsvergleich!I99","v":0},{"$f":"Angebotsvergleich!H99","v":0},{"$f":"Angebotsvergleich!C99","v":0},0,{"$f":"Angebotsvergleich!L99","v":0},0,{"$f":"Angebotsvergleich!T66","v":""},{"$f":"Angebotsvergleich!M99","v":0},{"$f":"Angebotsvergleich!N99","v":0},{"$f":"Angebotsvergleich!O99","v":0},{"$f":"Angebotsvergleich!P99*12","v":0},{"$f":"Angebotsvergleich!S99","v":""},{"$f":"Angebotsvergleich!Z369","v":0},"","",{"$f":"Angebotsvergleich!J99","v":0}]
[{"$f":"Angebotsvergleich!B67","v":"Anbieter 24"},{"$f":"'Nutzwertanalyse Angebotsvgl.'!$AA$48","v":{"$error":"#DIV/0!"}},{"$f":"'Nutzwertanalyse Angebotsvgl.'!$AA$49","v":{"$error":"#DIV/0!"}},{"$f":"Angebotsvergleich!J67","v":0},{"$f":"Angebotsvergleich!K67","v":0},{"$f":"Angebotsvergleich!L67","v":0},{"$f":"Angebotsvergleich!M67","v":0},{"$f":"Angebotsvergleich!N67","v":0},{"$f":"Angebotsvergleich!O67","v":0},{"$f":"Angebotsvergleich!P67","v":0},{"$f":"Angebotsvergleich!Q67","v":0},{"$f":"Angebotsvergleich!R67","v":0},{"$f":"Angebotsvergleich!S67","v":""},{"$f":"IF(Angebotsvergleich!E100>0,1-Angebotsvergleich!E100,\"\")","v":""},{"$f":"Angebotsvergleich!I100","v":0},{"$f":"Angebotsvergleich!H100","v":0},{"$f":"Angebotsvergleich!C100","v":0},0,{"$f":"Angebotsvergleich!L100","v":0},0,{"$f":"Angebotsvergleich!T67","v":""},{"$f":"Angebotsvergleich!M100","v":0},{"$f":"Angebotsvergleich!N100","v":0},{"$f":"Angebotsvergleich!O100","v":0},{"$f":"Angebotsvergleich!P100*12","v":0},{"$f":"Angebotsvergleich!S100","v":""},{"$f":"Angebotsvergleich!Z378","v":0},"","",{"$f":"Angebotsvergleich!J100","v":0}]
[{"$f":"Angebotsvergleich!B68","v":"Anbieter 25"},{"$f":"'Nutzwertanalyse Angebotsvgl.'!$AB$48","v":{"$error":"#DIV/0!"}},{"$f":"'Nutzwertanalyse Angebotsvgl.'!$AB$49","v":{"$error":"#DIV/0!"}},{"$f":"Angebotsvergleich!J68","v":0},{"$f":"Angebotsvergleich!K68","v":0},{"$f":"Angebotsvergleich!L68","v":0},{"$f":"Angebotsvergleich!M68","v":0},{"$f":"Angebotsvergleich!N68","v":0},{"$f":"Angebotsvergleich!O68","v":0},{"$f":"Angebotsvergleich!P68","v":0},{"$f":"Angebotsvergleich!Q68","v":0},{"$f":"Angebotsvergleich!R68","v":0},{"$f":"Angebotsvergleich!S68","v":""},{"$f":"IF(Angebotsvergleich!E101>0,1-Angebotsvergleich!E101,\"\")","v":""},{"$f":"Angebotsvergleich!I101","v":0},{"$f":"Angebotsvergleich!H101","v":0},{"$f":"Angebotsvergleich!C101","v":0},0,{"$f":"Angebotsvergleich!L101","v":0},0,{"$f":"Angebotsvergleich!T68","v":""},{"$f":"Angebotsvergleich!M101","v":0},{"$f":"Angebotsvergleich!N101","v":0},{"$f":"Angebotsvergleich!O101","v":0},{"$f":"Angebotsvergleich!P101*12","v":0},{"$f":"Angebotsvergleich!S101","v":""},{"$f":"Angebotsvergleich!Z387","v":0},"","",{"$f":"Angebotsvergleich!J101","v":0}]
[{"$f":"Angebotsvergleich!B69","v":"Anbieter 26"},{"$f":"'Nutzwertanalyse Angebotsvgl.'!$AC$48","v":{"$error":"#DIV/0!"}},{"$f":"'Nutzwertanalyse Angebotsvgl.'!$AC$49","v":{"$error":"#DIV/0!"}},{"$f":"Angebotsvergleich!J69","v":0},{"$f":"Angebotsvergleich!K69","v":0},{"$f":"Angebotsvergleich!L69","v":0},{"$f":"Angebotsvergleich!M69","v":0},{"$f":"Angebotsvergleich!N69","v":0},{"$f":"Angebotsvergleich!O69","v":0},{"$f":"Angebotsvergleich!P69","v":0},{"$f":"Angebotsvergleich!Q69","v":0},{"$f":"Angebotsvergleich!R69","v":0},{"$f":"Angebotsvergleich!S69","v":""},{"$f":"IF(Angebotsvergleich!E102>0,1-Angebotsvergleich!E102,\"\")","v":""},{"$f":"Angebotsvergleich!I102","v":0},{"$f":"Angebotsvergleich!H102","v":0},{"$f":"Angebotsvergleich!C102","v":0},0,{"$f":"Angebotsvergleich!L102","v":0},0,{"$f":"Angebotsvergleich!T69","v":""},{"$f":"Angebotsvergleich!M102","v":0},{"$f":"Angebotsvergleich!N102","v":0},{"$f":"Angebotsvergleich!O102","v":0},{"$f":"Angebotsvergleich!P102*12","v":0},{"$f":"Angebotsvergleich!S102","v":""},{"$f":"Angebotsvergleich!Z396","v":0},"","",{"$f":"Angebotsvergleich!J102","v":0}]
[{"$f":"Angebotsvergleich!B70","v":"Anbieter 27"},{"$f":"'Nutzwertanalyse Angebotsvgl.'!$AD$48","v":{"$error":"#DIV/0!"}},{"$f":"'Nutzwertanalyse Angebotsvgl.'!$AD$49","v":{"$error":"#DIV/0!"}},{"$f":"Angebotsvergleich!J70","v":0},{"$f":"Angebotsvergleich!K70","v":0},{"$f":"Angebotsvergleich!L70","v":0},{"$f":"Angebotsvergleich!M70","v":0},{"$f":"Angebotsvergleich!N70","v":0},{"$f":"Angebotsvergleich!O70","v":0},{"$f":"Angebotsvergleich!P70","v":0},{"$f":"Angebotsvergleich!Q70","v":0},{"$f":"Angebotsvergleich!R70","v":0},{"$f":"Angebotsvergleich!S70","v":""},{"$f":"IF(Angebotsvergleich!E103>0,1-Angebotsvergleich!E103,\"\")","v":""},{"$f":"Angebotsvergleich!I103","v":0},{"$f":"Angebotsvergleich!H103","v":0},{"$f":"Angebotsvergleich!C103","v":0},0,{"$f":"Angebotsvergleich!L103","v":0},0,{"$f":"Angebotsvergleich!T70","v":""},{"$f":"Angebotsvergleich!M103","v":0},{"$f":"Angebotsvergleich!N103","v":0},{"$f":"Angebotsvergleich!O103","v":0},{"$f":"Angebotsvergleich!P103*12","v":0},{"$f":"Angebotsvergleich!S103","v":""},{"$f":"Angebotsvergleich!Z405","v":0},"","",{"$f":"Angebotsvergleich!J103","v":0}]
[{"$f":"Angebotsvergleich!B71","v":"Anbieter 28"},{"$f":"'Nutzwertanalyse Angebotsvgl.'!$AE$48","v":{"$error":"#DIV/0!"}},{"$f":"'Nutzwertanalyse Angebotsvgl.'!$AE$49","v":{"$error":"#DIV/0!"}},{"$f":"Angebotsvergleich!J71","v":0},{"$f":"Angebotsvergleich!K71","v":0},{"$f":"Angebotsvergleich!L71","v":0},{"$f":"Angebotsvergleich!M71","v":0},{"$f":"Angebotsvergleich!N71","v":0},{"$f":"Angebotsvergleich!O71","v":0},{"$f":"Angebotsvergleich!P71","v":0},{"$f":"Angebotsvergleich!Q71","v":0},{"$f":"Angebotsvergleich!R71","v":0},{"$f":"Angebotsvergleich!S71","v":""},{"$f":"IF(Angebotsvergleich!E104>0,1-Angebotsvergleich!E104,\"\")","v":""},{"$f":"Angebotsvergleich!I104","v":0},{"$f":"Angebotsvergleich!H104","v":0},{"$f":"Angebotsvergleich!C104","v":0},0,{"$f":"Angebotsvergleich!L104","v":0},0,{"$f":"Angebotsvergleich!T71","v":""},{"$f":"Angebotsvergleich!M104","v":0},{"$f":"Angebotsvergleich!N104","v":0},{"$f":"Angebotsvergleich!O104","v":0},{"$f":"Angebotsvergleich!P104*12","v":0},{"$f":"Angebotsvergleich!S104","v":""},{"$f":"Angebotsvergleich!Z414","v":0},"","",{"$f":"Angebotsvergleich!J104","v":0}]
[{"$f":"Angebotsvergleich!B72","v":"Anbieter 29"},{"$f":"'Nutzwertanalyse Angebotsvgl.'!$AF$48","v":{"$error":"#DIV/0!"}},{"$f":"'Nutzwertanalyse Angebotsvgl.'!$AF$49","v":{"$error":"#DIV/0!"}},{"$f":"Angebotsvergleich!J72","v":0},{"$f":"Angebotsvergleich!K72","v":0},{"$f":"Angebotsvergleich!L72","v":0},{"$f":"Angebotsvergleich!M72","v":0},{"$f":"Angebotsvergleich!N72","v":0},{"$f":"Angebotsvergleich!O72","v":0},{"$f":"Angebotsvergleich!P72","v":0},{"$f":"Angebotsvergleich!Q72","v":0},{"$f":"Angebotsvergleich!R72","v":0},{"$f":"Angebotsvergleich!S72","v":""},{"$f":"IF(Angebotsvergleich!E105>0,1-Angebotsvergleich!E105,\"\")","v":""},{"$f":"Angebotsvergleich!I105","v":0},{"$f":"Angebotsvergleich!H105","v":0},{"$f":"Angebotsvergleich!C105","v":0},0,{"$f":"Angebotsvergleich!L105","v":0},0,{"$f":"Angebotsvergleich!T72","v":""},{"$f":"Angebotsvergleich!M105","v":0},{"$f":"Angebotsvergleich!N105","v":0},{"$f":"Angebotsvergleich!O105","v":0},{"$f":"Angebotsvergleich!P105*12","v":0},{"$f":"Angebotsvergleich!S105","v":""},{"$f":"Angebotsvergleich!Z423","v":0},"","",{"$f":"Angebotsvergleich!J105","v":0}]
[{"$f":"Angebotsvergleich!B73","v":"Anbieter 30"},{"$f":"'Nutzwertanalyse Angebotsvgl.'!$AG$48","v":{"$error":"#DIV/0!"}},{"$f":"'Nutzwertanalyse Angebotsvgl.'!$AG$49","v":{"$error":"#DIV/0!"}},{"$f":"Angebotsvergleich!J73","v":0},{"$f":"Angebotsvergleich!K73","v":0},{"$f":"Angebotsvergleich!L73","v":0},{"$f":"Angebotsvergleich!M73","v":0},{"$f":"Angebotsvergleich!N73","v":0},{"$f":"Angebotsvergleich!O73","v":0},{"$f":"Angebotsvergleich!P73","v":0},{"$f":"Angebotsvergleich!Q73","v":0},{"$f":"Angebotsvergleich!R73","v":0},{"$f":"Angebotsvergleich!S73","v":""},{"$f":"IF(Angebotsvergleich!E106>0,1-Angebotsvergleich!E106,\"\")","v":""},{"$f":"Angebotsvergleich!I106","v":0},{"$f":"Angebotsvergleich!H106","v":0},{"$f":"Angebotsvergleich!C106","v":0},0,{"$f":"Angebotsvergleich!L106","v":0},0,{"$f":"Angebotsvergleich!T73","v":""},{"$f":"Angebotsvergleich!M106","v":0},{"$f":"Angebotsvergleich!N106","v":0},{"$f":"Angebotsvergleich!O106","v":0},{"$f":"Angebotsvergleich!P106*12","v":0},{"$f":"Angebotsvergleich!S106","v":""},{"$f":"Angebotsvergleich!Z432","v":0},"","",{"$f":"Angebotsvergleich!J106","v":0}]

{"sheet":"D Nutzwerte","index":7,"n_rows":7,"n_cols":2,"rows_kept":7,"cut":false,"hidden":false,"merged":[]}
[null,"Link zur Navigationseite"]
[]
[null,"Berechnungshilfe für die Angebotsbewertung und Wirtschaftlichkeitsuntersuchung im Energiespar-Contracting"]
[]
["Projekt:",{"$f":"Angebotsvergleich!$B$7","v":"Testprojekt"}]
["Datum:",{"$f":"Angebotsvergleich!$B$8","v":"2016-01-01"}]
["Bearbeiter:",{"$f":"Angebotsvergleich!$B$9","v":"Testbearbeiter"}]

{"sheet":"Sensitivitätsanalyse","index":8,"n_rows":70,"n_cols":8,"rows_kept":70,"cut":false,"hidden":false,"merged":[]}
[null,"Link zur Navigationseite"]
[]
[null,"Berechnungshilfe für die Angebotsbewertung und Wirtschaftlichkeitsuntersuchung im Energiespar-Contracting"]
[]
[null,"Sensitivitätsanalyse"]
[null,"Wirtschaftlichkeitsnachweis bei veränderlichen wirtschaftlichen Rahmenbedingungen"]
[]
["Projekt:",{"$f":"Angebotsvergleich!$B$7","v":"Testprojekt"}]
["Datum:",{"$f":"Angebotsvergleich!$B$8","v":"2016-01-01"},null,"Berechnete Werte"]
["Bearbeiter:",{"$f":"Angebotsvergleich!$B$9","v":"Testbearbeiter"},null,"Alle Kostenangaben netto"]
[]
[null,"Eingaben in diesem Blatt:"]
[null,"In diesem Blatt sind keine Eingaben erforderlich."]
[null,"Über das Schaltfeld \"Zielwerte suchen\" können die Grenzfälle der Wirtschaftlichkeit berechnet werden."]
[]
[]
[]
[]
[null,{"$f":"\"Vergleich: Contracting-Anbieter \"&INDEX(Angebotsvergleich!B44:B73,Eigenbau!$C$21)&\" mit Eigenbaumaßnahme\"","v":"Vergleich: Contracting-Anbieter Anbieter 1 mit Eigenbaumaßnahme"}]
[]
[null,"Kapitalwerte Referenz"]
[null,{"$f":"\"Kapitalwert Contracting-Anbieter \"&bieter_nr","v":"Kapitalwert Contracting-Anbieter 1"},{"$f":"Eigenbau!X61","v":0}]
[null,"Kapitalwert Eigenbau",{"$f":"Eigenbau!X70","v":0}]
[]
[null,"Kapitalwertvorteil Contracting-Anbieter",{"$f":"k_contracting-k_eigen","v":0}]
[]
[null,null,null,null,null,null,null,"Kommentare (vgl. auch die Erläuterungen unterhalb der Sensitivitätstabelle)"]
[null,null,"Referenz",null,null,null,null," Referenz: Wirtschaftlichkeitsparameter aus Angebotsvergleich und Eigenbau-Berechnung"]
[null,null,null,"Kapitalwert Contracting = Kapitalwert Eigenbau",null,null,null,"- Gleicher Kapitalwert bedeuted, dass der monetäre Vergleich zwischen Contracting und Eigenbau keinen Vor- oder Nachteil ergibt"]
[null,null,null,null,"Kapitalwert Contracting = 0",null,null,"- Kapitalwert 0 bedeuted, dass für den AG kein monetärer Vor- oder Nachteil durch eine Contractingumsetzung entsteht"]
[null,null,null,null,null,"Kapitalwert Eigenbau = 0",null,"- Kapitalwert 0 bedeuted, dass für den AG kein monetärer Vor- oder Nachteil durch eine Eigenbauumsetzung entsteht"]
[null,"Jährliche Preissteigerungsraten"]
[null,"Energie",null,null,null,null,null,"Die in der nachfolgenden Tabelle ermittelten Prozentsätze gelten für die o.g. Grenzfälle:"]
[null,"Strom (unabhängig variiert)",0.03,"nicht möglich","nicht möglich","nicht möglich"]
[null,"Heizenergie (unabhängig variiert)",0.05,"nicht möglich","nicht möglich","nicht möglich",null,"- Spalte D: Oberhalb dieser Preissteigerungsraten ist Contracting wirtschaftlicher als der Eigenbau."]
[]
[null,"Strom (gekoppelt variiert)",null,0,0,0,null,"- Spalte E: Oberhalb dieser Preissteigerungsraten ist die Contracting-Variante wirtschaftlich"]
[null,"Heizenergie (gekoppelt variiert)",null,0,0,0]
[null,null,null,null,null,null,null,"- Spalte F: Oberhalb dieser Preissteigerungsraten ist die Eigenbau-Variante wirtschaftlich"]
[null,"Betriebskosten Eigenbau",null,0,0,0]
[null,null,null,0,0,0]
[null,"Risikoaufschlag Investition"]
[null,null,null,0,0,0]
[null,"Referenzpreis Umweltkosten [€/tCO2]"]
[null,null,0.1,0.1,0.1,0.1]
[null,"Einsparprognose Eigenbau zur garant. Einspar."]
[null,null,80,"nicht möglich","nicht möglich","nicht möglich"]
[]
[null,null,0,0,0,0]
[]
[null,"Erläuterungen (vgl. auch Leitfaden Kapitel 10.3 Wirtschaftlichkeit bei veränderten Rahmenbedingungen - Sensitivitätsanalyse)"]
[]
[null,"Im Rahmen der Sensitivitätsanalyse werden die einzelnen Parameter in der Wirtschaftlichkeitsrechnung variiert und die Änderungen des Kapitalwertes"]
[null,"ausgewertet. Die Preissteigerungsraten der Elektro- und Heizenergie können sowohl voneinander getrennt als auch gekoppelt variiert werden. Zeigt sich,"]
[null,"dass sich der Kapitalwert der betrachteten Variante bei nur geringfügiger Änderung des jeweiligen Eingangsparameters stark ändert, ist dieser Parameter sensitiv."]
[]
[null,"Grenzfälle der Sensitivitätsanalyse sind:"]
[null,"- die Parität der Contracting-Variante zum Eigenbau (Kapitalwert Contracting = Kapitalwert Eigenbau)"]
[null,"- die Unwirtschaftlichkeit der Contracting-Variante (Kapitalwert Contracting = 0)"]
[null,"- die Unwirtschaftlichkeit des Eigenbaus (Kapitalwert Eigenbau = 0)"]
[]
[null,"Im ersten Grenzfall ist die Durchführung der Energiesparmaßnahme mittels Contracting unter monetären Gesichtspunkten gleichwertig gegenüber dem"]
[null,"Eigenbau zu beurteilen. Im zweiten Grenzfall wird die Summe der barwertigen Nettoeinsparungen (Kapitalwert) der Contracting-Lösung aus"]
[null,"Sicht des Auftraggebers gerade zu Null und damit wird die Beschaffung über ein Contracting unwirtschaftlich. Im dritten Grenzfall gilt das gleiche Kriterium"]
[null,"für die Beschaffung im Eigenbau, auch hier wird die Beschaffung unwirtschaftlich."]
[]
[null,"Die so gefundenen Parameterwerte sind auf ihre Wahrscheinlichkeit des Eintretens hin zu untersuchen. Liegt ein Parameter, der zur Unwirtschaftlichkeit"]
[null,"einer Variante führt, nur unmaßgeblich von seinem Referenzwert entfernt, so muss dies in der Bewertung der Beschaffungsvariante berücksichtigt werden."]
[]
[null,"Konnte kein Grenzfall berechnet werden (nicht möglich), bleiben die Referenzwerte maßgebend. "]